Can't make biomes?

Started by LightningSplash on Sat, 05/07/2016 - 21:21

Topic category: Bugs and solutions

Last seen on 00:43, 22. Aug 2019
Joined Aug 2015
User points:

Statistics:

  • Comments:
  • Forum topics:
  • Modifications:
  • Wiki pages:
Can't make biomes?
Sat, 05/07/2016 - 21:21

I'm trying to test out biomes and everytime I do it just creates an error.

Log:


Executing gradle command: clean build
Microsoft Windows [Version 10.0.10586]
(c) 2015 Microsoft Corporation. All rights reserved.
C:\Pylo\MCreator167>cd forge
C:\Pylo\MCreator167\forge>SET "JAVA_HOME=C:\Pylo\MCreator167\jdk64\"
C:\Pylo\MCreator167\forge>SET JAVA_EXE=%JAVA_HOME%\bin\java.exe
C:\Pylo\MCreator167\forge>SET PATH=%JAVA_HOME%\bin\;%PATH%
C:\Pylo\MCreator167\forge>SET "JAVA_OPTS=-Xmx2048m -Xms625m"
C:\Pylo\MCreator167\forge>gradlew clean build
#################################################
         ForgeGradle 2.1-SNAPSHOT-da90449        
  https://github.com/MinecraftForge/ForgeGradle  
#################################################
               Powered by MCP unknown               
             http://modcoderpack.com             
         by: Searge, ProfMobius, Fesh0r,         
         R4wk, ZeuX, IngisKahn, bspkrs           
#################################################
:clean
:deobfCompileDummyTask
:deobfProvidedDummyTask
:sourceApiJava
:compileApiJava UP-TO-DATE
:processApiResources UP-TO-DATE
:apiClasses UP-TO-DATE
:sourceMainJava
C:\Pylo\MCreator167\forge\build\sources\main\java\mod\mcreator\mcreator_darkWoods.java:149: error: constructor SpawnListEntry in class SpawnListEntry cannot be applied to given types;
this.spawnableMonsterList.add(new SpawnListEntry(EntityLightningBolt.class, 5, 1, 5));
                              ^
  required: Class<? extends EntityLiving>,int,int,int
  found: Class<EntityLightningBolt>,int,int,int
  reason: actual argument Class<EntityLightningBolt> cannot be converted to Class<? extends EntityLiving> by method invocation conversion
1 error
:compileJava FAILED
FAILURE: Build failed with an exception.
BUILD FAILED
* What went wrong:
Execution failed for task ':compileJava'.
Total time: 25.133 secs
> Compilation failed; see the compiler error output for details.
* Try:
Run with --stacktrace option to get the stack trace. Run with --info or --debug option to get more log output.
C:\Pylo\MCreator167\forge>
Task completed with return code 0 in 28781 milliseconds
   
Executing gradle command: clean runClient
Microsoft Windows [Version 10.0.10586]
(c) 2015 Microsoft Corporation. All rights reserved.
C:\Pylo\MCreator167>cd forge
C:\Pylo\MCreator167\forge>SET "JAVA_HOME=C:\Pylo\MCreator167\jdk64\"
C:\Pylo\MCreator167\forge>SET JAVA_EXE=%JAVA_HOME%\bin\java.exe
C:\Pylo\MCreator167\forge>SET PATH=%JAVA_HOME%\bin\;%PATH%
C:\Pylo\MCreator167\forge>SET "JAVA_OPTS=-Xmx2048m -Xms625m"
C:\Pylo\MCreator167\forge>gradlew clean runClient
#################################################
         ForgeGradle 2.1-SNAPSHOT-da90449        
  https://github.com/MinecraftForge/ForgeGradle  
#################################################
               Powered by MCP unknown               
             http://modcoderpack.com             
         by: Searge, ProfMobius, Fesh0r,         
         R4wk, ZeuX, IngisKahn, bspkrs           
#################################################
:clean
:deobfCompileDummyTask
:deobfProvidedDummyTask
:sourceApiJava
:compileApiJava UP-TO-DATE
:processApiResources UP-TO-DATE
:apiClasses UP-TO-DATE
:sourceMainJava
C:\Pylo\MCreator167\forge\build\sources\main\java\mod\mcreator\mcreator_darkWoods.java:149: error: constructor SpawnListEntry in class SpawnListEntry cannot be applied to given types;
this.spawnableMonsterList.add(new SpawnListEntry(EntityLightningBolt.class, 5, 1, 5));
                              ^
  required: Class<? extends EntityLiving>,int,int,int
  found: Class<EntityLightningBolt>,int,int,int
  reason: actual argument Class<EntityLightningBolt> cannot be converted to Class<? extends EntityLiving> by method invocation conversion
1 error
:compileJava FAILED
FAILURE: Build failed with an exception.
* What went wrong:
Execution failed for task ':compileJava'.
> Compilation failed; see the compiler error output for details.
BUILD FRun with --stacktrace option to get the stack trace. Run with --info or --debug option to get more log output.
AILED
* Try:
Total time: 16.32 secs
C:\Pylo\MCreator167\forge>
Task completed with return code 0 in 18246 milliseconds

 

Last seen on 11:47, 30. May 2018
Joined Mar 2015
User points:

Statistics:

  • Comments:
  • Forum topics:
  • Modifications:
  • Wiki pages:
I had this issue when using
Wed, 05/11/2016 - 12:16

I had this issue when using my 32-bit computer. Seems to work fine in my dad's 64-bit computer. I'm not sure if it's that or if it's because my cpu is also slower than my dad's.

Last seen on 03:45, 14. Jun 2016
Joined Apr 2016
User points:

Statistics:

  • Comments:
  • Forum topics:
  • Modifications:
  • Wiki pages:
Easily, this is the reason
Wed, 05/11/2016 - 19:56

Easily, this is the reason (your pc), the 1.9 biomes are different, so, they are harder to compile (the error), and you need more RAM (DONT increase it, it will be worst)