Exporting Not Working

Started by Farfalonous on Thu, 12/18/2014 - 18:33
Last seen on 22:49, 19. Dec 2014
Joined Jul 2014
User points:

Statistics:

  • Comments:
  • Forum topics:
  • Modifications:
  • Wiki pages:
Exporting Not Working
Thu, 12/18/2014 - 18:33

Help! Everytime I export my mod I get this:C:\Users\Owner\Downloads\MCreator 1.5.2 [1.7.10]\forge\build\sources\java\mcreator_nightmare.java:151: error: EntityAIDoorInteract is abstract; cannot be instantiated

this.tasks.addTask(1, new EntityAIDoorInteract(this));                       ^ C:\Users\Owner\Downloads\MCreator 1.5.2 [1.7.10]\forge\build\sources\java\mcreator_nightmare.java:226: error: cannot find symbol setResistance(5.0F); ^   symbol:   method setResistance(float)   location: class Entitynightmare 2 errors   FAILURE: Build failed with an exception.   * What went wrong: Execution failed for task ':compileJava'. > Compilation failed; see the compiler error output for details.   * Try: Run with --stacktrace option to get the stack trace. Run with --info or --debug option to get more log output.  
Last seen on 10:06, 30. Mar 2016
Joined Sep 2014
User points:

Statistics:

  • Comments:
  • Forum topics:
  • Modifications:
  • Wiki pages:
I know what the problem is.
Fri, 12/19/2014 - 07:58

I know what the problem is. Giving mobs the ability to open and close doors doesn't work. Hopefully, this will be fixed in the future. In the meantime, don't give mobs the AI task that allows them to open or close doors, or they won't compile correctly.

Last seen on 22:24, 30. Dec 2014
Joined Dec 2014
User points:

Statistics:

  • Comments:
  • Forum topics:
  • Modifications:
  • Wiki pages:
RE:I know what the problem is.
Mon, 12/29/2014 - 17:01

@#1 I am not using those AI tasks and yet I still have the same problem over and over again!

compileJava FAILED
>FAILURE: Build failed with an exception.
>* What went wrong:
>Execution failed for task ':compileJava'.

Last seen on 05:24, 26. Jan 2017
Joined Nov 2014
User points:

Statistics:

  • Comments:
  • Forum topics:
  • Modifications:
  • Wiki pages:
haha i have the SAME problem
Tue, 12/30/2014 - 03:53

haha i have the SAME problem over and over and OVER again with the export. look at this MASSIVE error >:/ \/\/\/\/
>:compileApiJava UP-TO-DATE
>:processApiResources UP-TO-DATE
>:apiClasses UP-TO-DATE
>:sourceMainJava
>C:\Users\jayjay\Desktop\forge\build\sources\java\mod\mcreator\ModName.java:109: error: cannot find symbol
>mcreator_wonderFulForestDimension mcreator_1 = new mcreator_wonderFulForestDimension();
>^
> symbol: class mcreator_wonderFulForestDimension
> location: class ModName
>C:\Users\jayjay\Desktop\forge\build\sources\java\mod\mcreator\ModName.java:110: error: cannot find symbol
>mcreator_tropicalPinaple mcreator_2 = new mcreator_tropicalPinaple();
>^
> symbol: class mcreator_tropicalPinaple
> location: class ModName
>C:\Users\jayjay\Desktop\forge\build\sources\java\mod\mcreator\ModName.java:111: error: cannot find symbol
>mcreator_log mcreator_3 = new mcreator_log();
>^
> symbol: class mcreator_log
> location: class ModName
>C:\Users\jayjay\Desktop\forge\build\sources\java\mod\mcreator\ModName.java:112: error: cannot find symbol
>mcreator_tropical mcreator_4 = new mcreator_tropical();
>^
> symbol: class mcreator_tropical
> location: class ModName
>C:\Users\jayjay\Desktop\forge\build\sources\java\mod\mcreator\ModName.java:109: error: cannot find symbol
>mcreator_wonderFulForestDimension mcreator_1 = new mcreator_wonderFulForestDimension();
> ^
> symbol: class mcreator_wonderFulForestDimension
> location: class ModName
>C:\Users\jayjay\Desktop\forge\build\sources\java\mod\mcreator\ModName.java:110: error: cannot find symbol
>mcreator_tropicalPinaple mcreator_2 = new mcreator_tropicalPinaple();
> ^
> symbol: class mcreator_tropicalPinaple
> location: class ModName
>C:\Users\jayjay\Desktop\forge\build\sources\java\mod\mcreator\ModName.java:111: error: cannot find symbol
>mcreator_log mcreator_3 = new mcreator_log();
> ^
> symbol: class mcreator_log
> location: class ModName
>C:\Users\jayjay\Desktop\forge\build\sources\java\mod\mcreator\ModName.java:112: error: cannot find symbol
>mcreator_tropical mcreator_4 = new mcreator_tropical();
> ^
> symbol: class mcreator_tropical
> location: class ModName
>8 errors
>:compileJava FAILED
>FAILURE: Build failed with an exception.
>* What went wrong:
>Execution failed for task ':compileJava'.
>BUILD FAILED
>> Compilation failed; see the compiler error output for details.
>* Try:
>Run with --stacktrace option to get the stack trace. Run with --info or --debug option to get more log output.
>Total time: 7.785 secs
>C:\Users\jayjay\Desktop\forge>
>Task completed with return code 0 in 8377 milliseconds

Last seen on 05:24, 26. Jan 2017
Joined Nov 2014
User points:

Statistics:

  • Comments:
  • Forum topics:
  • Modifications:
  • Wiki pages:
GRRRR
Tue, 12/30/2014 - 03:54

GRRRR

Last seen on 05:24, 26. Jan 2017
Joined Nov 2014
User points:

Statistics:

  • Comments:
  • Forum topics:
  • Modifications:
  • Wiki pages:
RE:I know what the problem is.
Tue, 12/30/2014 - 03:55

@#1 how about this >BOOTING UP GRADLE...
>Data loaded, MCreator gradle console ready [ver 1.007]! [boot took 0 milliseconds]
>RIGHT click once to copy log to the clipboard or twice to clear the log.
>===================================================================================================================
>Executing gradle command: build
>Microsoft Windows [Version 6.1.7601]
>Copyright (c) 2009 Microsoft Corporation. All rights reserved.
>C:\Users\jayjay\Desktop>cd forge
>C:\Users\jayjay\Desktop\forge>SET "JAVA_HOME=C:\Users\jayjay\Desktop\jdk\"
>C:\Users\jayjay\Desktop\forge>SET JAVA_EXE=%JAVA_HOME%\bin\java.exe
>C:\Users\jayjay\Desktop\forge>SET PATH=%JAVA_HOME%\bin\;%PATH%
>C:\Users\jayjay\Desktop\forge>gradlew build
>****************************
> Powered By MCP:
> http://mcp.ocean-labs.de/
> Searge, ProfMobius, Fesh0r,
> R4wk, ZeuX, IngisKahn, bspkrs
> MCP Data version : unknown
>****************************
>:compileApiJava UP-TO-DATE
>:processApiResources UP-TO-DATE
>:apiClasses UP-TO-DATE
>:sourceMainJava
>C:\Users\jayjay\Desktop\forge\build\sources\java\mod\mcreator\ModName.java:109: error: cannot find symbol
>mcreator_wonderFulForestDimension mcreator_1 = new mcreator_wonderFulForestDimension();
>^
> symbol: class mcreator_wonderFulForestDimension
> location: class ModName
>C:\Users\jayjay\Desktop\forge\build\sources\java\mod\mcreator\ModName.java:110: error: cannot find symbol
>mcreator_tropicalPinaple mcreator_2 = new mcreator_tropicalPinaple();
>^
> symbol: class mcreator_tropicalPinaple
> location: class ModName
>C:\Users\jayjay\Desktop\forge\build\sources\java\mod\mcreator\ModName.java:111: error: cannot find symbol
>mcreator_log mcreator_3 = new mcreator_log();
>^
> symbol: class mcreator_log
> location: class ModName
>C:\Users\jayjay\Desktop\forge\build\sources\java\mod\mcreator\ModName.java:112: error: cannot find symbol
>mcreator_tropical mcreator_4 = new mcreator_tropical();
>^
> symbol: class mcreator_tropical
> location: class ModName
>C:\Users\jayjay\Desktop\forge\build\sources\java\mod\mcreator\ModName.java:109: error: cannot find symbol
>mcreator_wonderFulForestDimension mcreator_1 = new mcreator_wonderFulForestDimension();
> ^
> symbol: class mcreator_wonderFulForestDimension
> location: class ModName
>C:\Users\jayjay\Desktop\forge\build\sources\java\mod\mcreator\ModName.java:110: error: cannot find symbol
>mcreator_tropicalPinaple mcreator_2 = new mcreator_tropicalPinaple();
> ^
> symbol: class mcreator_tropicalPinaple
> location: class ModName
>C:\Users\jayjay\Desktop\forge\build\sources\java\mod\mcreator\ModName.java:111: error: cannot find symbol
>mcreator_log mcreator_3 = new mcreator_log();
> ^
> symbol: class mcreator_log
> location: class ModName
>C:\Users\jayjay\Desktop\forge\build\sources\java\mod\mcreator\ModName.java:112: error: cannot find symbol
>mcreator_tropical mcreator_4 = new mcreator_tropical();
> ^
> symbol: class mcreator_tropical
> location: class ModName
>8 errors
>:compileJava FAILED
>FAILURE: Build failed with an exception.
>* What went wrong:
>Execution failed for task ':compileJava'.
>BUILD FAILED
>> Compilation failed; see the compiler error output for details.
>* Try:
>Run with --stacktrace option to get the stack trace. Run with --info or --debug option to get more log output.
>Total time: 7.785 secs
>C:\Users\jayjay\Desktop\forge>
>Task completed with return code 0 in 8377 milliseconds

could you help me with that?

Last seen on 08:13, 1. Aug 2015
Joined Jan 2015
User points:

Statistics:

  • Comments:
  • Forum topics:
  • Modifications:
  • Wiki pages:
Mine says error: cannot find
Thu, 01/15/2015 - 13:31

Mine says error: cannot find symbol as well. :(

Last seen on 19:04, 19. Jul 2015
Joined Jul 2015
User points:

Statistics:

  • Comments:
  • Forum topics:
  • Modifications:
  • Wiki pages:
da fuq  
Sat, 07/18/2015 - 01:47

da fuq

 

Last seen on 14:11, 2. Dec 2015
Joined Oct 2014
User points:

Statistics:

  • Comments:
  • Forum topics:
  • Modifications:
  • Wiki pages:
did you use a custom code or
Sat, 07/18/2015 - 07:01

did you use a custom code or did you change anything in the source code?