Build.gradle line 21 Error

Started by hogsmoss on Sun, 12/21/2014 - 22:32
Last seen on 19:25, 16. Jun 2016
Joined Dec 2014
User points:

Statistics:

  • Comments:
  • Forum topics:
  • Modifications:
  • Wiki pages:
Build.gradle line 21 Error
Sun, 12/21/2014 - 22:32

Idk but when I wanna test this happens

>===================================================================================================================
>Executing gradle command: build
>Microsoft Windows [Version 6.3.9600]
>(c) 2013 Microsoft Corporation. All rights reserved.
>C:\Users\dustin\Desktop\IAN>cd forge
>C:\Users\dustin\Desktop\IAN\forge>SET "JAVA_HOME=C:\Users\dustin\Desktop\IAN\jdk\"
>C:\Users\dustin\Desktop\IAN\forge>SET JAVA_EXE=%JAVA_HOME%\bin\java.exe
>C:\Users\dustin\Desktop\IAN\forge>SET PATH=%JAVA_HOME%\bin\;%PATH%
>C:\Users\dustin\Desktop\IAN\forge>gradlew build
>FAILURE: Build failed with an exception.
>* Where:
>Build file 'C:\Users\dustin\Desktop\IAN\forge\build.gradle' line: 21
>* What went wrong:
>A problem occurred evaluating root project 'forge'.
>> No such property: group for class: java.lang.String
>BUILD FAILED
>* Try:
>Run with --stacktrace option to get the stack trace. Run with --info or --debug option to get more log output.
>Total time: 3.238 secs
>C:\Users\dustin\Desktop\IAN\forge>
>Task completed with return code 0 in 3733 milliseconds
>Task return code check OK!

Last seen on 15:56, 7. Apr 2015
Joined Apr 2015
User points:

Statistics:

  • Comments:
  • Forum topics:
  • Modifications:
  • Wiki pages:
I have a similar problem, but
Tue, 04/07/2015 - 15:55

I have a similar problem, but in line 18th

Last seen on 19:31, 19. Feb 2017
Joined Mar 2015
User points:

Statistics:

  • Comments:
  • Forum topics:
  • Modifications:
  • Wiki pages:
RE:I have a similar problem, but
Wed, 06/10/2015 - 22:55

@#1 Same!

 

Last seen on 13:19, 19. Sep 2016
Joined Dec 2014
User points:

Statistics:

  • Comments:
  • Forum topics:
  • Modifications:
  • Wiki pages:
RE:RE:I have a similar problem, but
Wed, 09/16/2015 - 13:43

Ok, so I have a problem with build.gradle too. When I try to do a test enviroment, it gives me this error. The same error happens with server test environment, and exporting the mod. So basically, I can't test my mod anyhow. I hope that someone will help me, thanks,

-Staer


===================================================================================================================================
Executing gradle command: clean runClient
FAILURE: Build failed with an exception.
* What went wrong:
A problem occurred configuring root project 'forge'.
> Could not open buildscript class cache for build file '/Users/pojat/Desktop/MCreator/forge/build.gradle' (/private/var/root/.gradle/caches/2.0/scripts/build_5f1hd5vf2187st1aupm668mcus/ProjectScript/buildscript).
   > Timeout waiting to lock buildscript class cache for build file '/Users/pojat/Desktop/MCreator/forge/build.gradle' (/private/var/root/.gradle/caches/2.0/scripts/build_5f1hd5vf2187st1aupm668mcus/ProjectScript/buildscript). It is currently in use by another Gradle instance.
     Owner PID: unknown
     Our PID: 8674
     Owner Operation: unknown
     Our operation: Initialize cache
     Lock file: /private/var/root/.gradle/caches/2.0/scripts/build_5f1hd5vf2187st1aupm668mcus/ProjectScript/buildscript/cache.properties.lock
* Try:
Run with --stacktrace option to get the stack trace. Run with --info or --debug option to get more log output.
BUILD FAILED
Total time: 1 mins 7.218 secs

 

Last seen on 15:47, 17. Nov 2017
Joined Aug 2014
User points:

Statistics:

  • Comments:
  • Forum topics:
  • Modifications:
  • Wiki pages:
Its an install problem, try
Thu, 09/17/2015 - 18:19

Its an install problem, try to desinstall the program and istall it again but in .zip 

Sorry for my bad english

Last seen on 18:41, 14. Jun 2018
Joined Mar 2014
User points:

Statistics:

  • Comments:
  • Forum topics:
  • Modifications:
  • Wiki pages:
Same problem,but line 10.
Fri, 04/28/2017 - 17:02

Same problem,but line 10.