Error compiling mob

Started by takochako987 on Tue, 01/06/2015 - 01:38
Last seen on 03:22, 31. Jan 2016
Joined Jan 2015
User points:

Statistics:

  • Comments:
  • Forum topics:
  • Modifications:
  • Wiki pages:
Error compiling mob
Tue, 01/06/2015 - 01:38

I was trying to finish a mob i made but when i tried to finish it, it crashed. Here is the Gradle Log

 

>BOOTING UP GRADLE...

>Data loaded, MCreator gradle console ready [ver 1.007]! [boot took 0 milliseconds] >RIGHT click once to copy log to the clipboard or twice to clear the log. >=================================================================================================================== >Executing gradle command: build >Microsoft Windows [Version 6.3.9600] >(c) 2013 Microsoft Corporation. All rights reserved. >C:\Pylo\MCreator154>cd forge >C:\Pylo\MCreator154\forge>SET "JAVA_HOME=C:\Pylo\MCreator154\jdk\" >C:\Pylo\MCreator154\forge>SET JAVA_EXE=%JAVA_HOME%\bin\java.exe >C:\Pylo\MCreator154\forge>SET PATH=%JAVA_HOME%\bin\;%PATH% >C:\Pylo\MCreator154\forge>gradlew build >**************************** > Powered By MCP:              > http://mcp.ocean-labs.de/    > Searge, ProfMobius, Fesh0r,  > R4wk, ZeuX, IngisKahn, bspkrs > MCP Data version : unknown >**************************** >:compileApiJava UP-TO-DATE >:processApiResources UP-TO-DATE >:apiClasses UP-TO-DATE >:sourceMainJava >:compileJava >:processResources >:classes >:jar >:compileTestJava UP-TO-DATE >:processTestResources UP-TO-DATE >:testClasses UP-TO-DATE >:test UP-TO-DATE >:extractMcpData UP-TO-DATE >:getVersionJson >:extractUserDev UP-TO-DATE >:genSrgs SKIPPED >:reobf >:assemble >:check UP-TO-DATE >:build >BUILD SUCCESSFUL >Total time: 28.468 secs >C:\Pylo\MCreator154\forge> >Task completed with return code 0 in 29655 milliseconds >Task return code check OK! >=================================================================================================================== >Executing gradle command: build >Microsoft Windows [Version 6.3.9600] >(c) 2013 Microsoft Corporation. All rights reserved. >C:\Pylo\MCreator154>cd forge >C:\Pylo\MCreator154\forge>SET "JAVA_HOME=C:\Pylo\MCreator154\jdk\" >C:\Pylo\MCreator154\forge>SET JAVA_EXE=%JAVA_HOME%\bin\java.exe >C:\Pylo\MCreator154\forge>SET PATH=%JAVA_HOME%\bin\;%PATH% >C:\Pylo\MCreator154\forge>gradlew build >**************************** > Powered By MCP:              > http://mcp.ocean-labs.de/    > Searge, ProfMobius, Fesh0r,  > R4wk, ZeuX, IngisKahn, bspkrs > MCP Data version : unknown >**************************** >:compileApiJava UP-TO-DATE >:processApiResources UP-TO-DATE >:apiClasses UP-TO-DATE >:sourceMainJava

>C:\Pylo\MCreator154\forge\build\sources\java\mod\mcreator\mcreator_bouncyBubble.java:110: error: cannot find symbol

> RenderingRegistry.registerEntityRenderingHandler(mcreator_bouncyBubble.EntitybouncyBubble.class, new RenderLiving(new mcreator_bouncyBubble.Modelrubberbubble.java(), 0){protected ResourceLocation getEntityTexture(Entity par1Entity){return new ResourceLocation("New.png");}});

>                                                                                                                                           ^ >  symbol:   class Modelrubberbubble >  location: class mcreator_bouncyBubble >1 error >:compileJava FAILED >FAILURE: Build failed with an exception. >* What went wrong: >Execution failed for task ':compileJava'. >BUILD FAILED >> Compilation failed; see the compiler error output for details. >* Try: >Total time: 7.615 secs >Run with --stacktrace option to get the stack trace. Run with --info or --debug option to get more log output. >C:\Pylo\MCreator154\forge> >Task completed with return code 0 in 8505 milliseconds     Please help! Thanks in advance!  
Last seen on 03:22, 31. Jan 2016
Joined Jan 2015
User points:

Statistics:

  • Comments:
  • Forum topics:
  • Modifications:
  • Wiki pages:
Sorry, the button lagged and
Tue, 01/06/2015 - 01:38

Sorry, the button lagged and i accidently double posted.