[SOLVED] Build failed

Started by MirkoCrafter on Tue, 03/03/2015 - 21:42
Last seen on 01:32, 5. Mar 2015
Joined Mar 2015
User points:

Statistics:

  • Comments:
  • Forum topics:
  • Modifications:
  • Wiki pages:
[SOLVED] Build failed
Wed, 03/04/2015 - 07:31 (edited)

I always have an error and dont know what to do:

 

>[Fatal Error] jobs-3.5.300-v20130429-1813.pom:1:44: Content ist nicht zulässig in Prolog.
>[Fatal Error] expressions-3.3.0-v20070606-0010.pom:1:44: Content ist nicht zulässig in Prolog.
>FAILURE: Build failed with an exception.
>* What went wrong:
>A problem occurred configuring root project 'forge'.
>> Could not resolve all dependencies for configuration ':classpath'.
>   > Could not resolve org.eclipse.core:expressions:[3.1.0,4.0.0).
>     Required by:
>         :forge:unspecified > net.minecraftforge.gradle:ForgeGradle:1.2-SNAPSHOT > net.minecraftforge.srg2source:Srg2Source:3.2-SNAPSHOT > org.eclipse.core:resources:3.2.1-R32x_v20060914
>      > Could not parse POM http://repo1.maven.org/maven2/org/eclipse/core/expressions/3.3.0-v20070…
>BUILD FAILED
>         > Content ist nicht zulässig in Prolog.

:(

Edited by MirkoCrafter on Wed, 03/04/2015 - 07:31
Last seen on 01:32, 5. Mar 2015
Joined Mar 2015
User points:

Statistics:

  • Comments:
  • Forum topics:
  • Modifications:
  • Wiki pages:
Just need to run the Exe as
Wed, 03/04/2015 - 07:32

Just need to run the Exe as Admin -.- that was so simple xD

Last seen on 16:23, 13. Mar 2015
Joined Mar 2015
User points:

Statistics:

  • Comments:
  • Forum topics:
  • Modifications:
  • Wiki pages:
RE:Just need to run the Exe as
Thu, 03/12/2015 - 17:29

@#1 Uhm i Have the same problem, but i ran it as Adminstrator!

Last seen on 19:52, 19. Mar 2015
Joined Mar 2015
User points:

Statistics:

  • Comments:
  • Forum topics:
  • Modifications:
  • Wiki pages:
RE:RE:Just need to run the Exe as
Thu, 03/12/2015 - 18:11

@#1.1 >BOOTING UP GRADLE...
>Data loaded, MCreator gradle console ready [ver 1.007]! [boot took 10 milliseconds]
>RIGHT click once to copy log to the clipboard or twice to clear the log.
>=========================================================================================================================
>Executing gradle command: eclipse
>Microsoft Windows [Version 6.3.9600]
>(c) 2013 Microsoft Corporation. All rights reserved.
>C:\pylo\MCreator>cd forge
>C:\pylo\MCreator\forge>SET "JAVA_HOME=C:\pylo\MCreator\jdk\"
>C:\pylo\MCreator\forge>SET JAVA_EXE=%JAVA_HOME%\bin\java.exe
>C:\pylo\MCreator\forge>SET PATH=%JAVA_HOME%\bin\;%PATH%
>C:\pylo\MCreator\forge>gradlew eclipse
>****************************
> Powered By MCP:
> http://mcp.ocean-labs.de/
> Searge, ProfMobius, Fesh0r,
> R4wk, ZeuX, IngisKahn, bspkrs
> MCP Data version : unknown
>****************************
>=========================================================================================================================
>Executing gradle command: build
>Microsoft Windows [Version 6.3.9600]
>(c) 2013 Microsoft Corporation. All rights reserved.
>C:\pylo\MCreator>cd forge
>C:\pylo\MCreator\forge>SET "JAVA_HOME=C:\pylo\MCreator\jdk\"
>C:\pylo\MCreator\forge>SET JAVA_EXE=%JAVA_HOME%\bin\java.exe
>C:\pylo\MCreator\forge>SET PATH=%JAVA_HOME%\bin\;%PATH%
>C:\pylo\MCreator\forge>gradlew build
>****************************
> Powered By MCP:
> http://mcp.ocean-labs.de/
> Searge, ProfMobius, Fesh0r,
> R4wk, ZeuX, IngisKahn, bspkrs
> MCP Data version : unknown
>****************************
>:downloadClient SKIPPED
>:downloadServer SKIPPED
>:getVersionJson
>=========================================================================================================================
>Executing gradle command: build
>Microsoft Windows [Version 6.3.9600]
>(c) 2013 Microsoft Corporation. All rights reserved.
>C:\pylo\MCreator>cd forge
>C:\pylo\MCreator\forge>SET "JAVA_HOME=C:\pylo\MCreator\jdk\"
>C:\pylo\MCreator\forge>SET JAVA_EXE=%JAVA_HOME%\bin\java.exe
>C:\pylo\MCreator\forge>SET PATH=%JAVA_HOME%\bin\;%PATH%
>C:\pylo\MCreator\forge>gradlew build
>****************************
> Powered By MCP:
> http://mcp.ocean-labs.de/
> Searge, ProfMobius, Fesh0r,
> R4wk, ZeuX, IngisKahn, bspkrs
> MCP Data version : unknown
>****************************
>:downloadClient SKIPPED
>:downloadServer SKIPPED
>:getVersionJson
>=========================================================================================================================
>Executing gradle command: build
>Microsoft Windows [Version 6.3.9600]
>(c) 2013 Microsoft Corporation. All rights reserved.
>C:\pylo\MCreator>cd forge
>C:\pylo\MCreator\forge>SET "JAVA_HOME=C:\pylo\MCreator\jdk\"
>C:\pylo\MCreator\forge>SET JAVA_EXE=%JAVA_HOME%\bin\java.exe
>C:\pylo\MCreator\forge>SET PATH=%JAVA_HOME%\bin\;%PATH%
>C:\pylo\MCreator\forge>gradlew build
>****************************
> Powered By MCP:
> http://mcp.ocean-labs.de/
> Searge, ProfMobius, Fesh0r,
> R4wk, ZeuX, IngisKahn, bspkrs
> MCP Data version : unknown
>****************************
>:downloadClient SKIPPED
>:downloadServer SKIPPED
>:getVersionJson

I ran it as admin and this is my log from boot. It won't Compile.

Last seen on 16:23, 13. Mar 2015
Joined Mar 2015
User points:

Statistics:

  • Comments:
  • Forum topics:
  • Modifications:
  • Wiki pages:
RE:RE:RE:Just need to run the Exe as
Fri, 03/13/2015 - 14:49

@#1.1.1 Exactly!

Last seen on 19:52, 19. Mar 2015
Joined Mar 2015
User points:

Statistics:

  • Comments:
  • Forum topics:
  • Modifications:
  • Wiki pages:
RE:RE:RE:RE:Just need to run the Exe as
Fri, 03/13/2015 - 19:43

@#1.1.1.1 I got it to work I just deleted it and ran the installer again.

Last seen on 18:46, 10. May 2015
Joined May 2015
User points:

Statistics:

  • Comments:
  • Forum topics:
  • Modifications:
  • Wiki pages:
I need some help please.
Sun, 05/10/2015 - 16:59

I need some help please.

A build problem, but different to yours, here's the info:

 

>========================================================================================================================= >Executing gradle command: build >Microsoft Windows [Version 6.3.9600] >(c) 2013 Microsoft Corporation. All rights reserved. >C:\Users\naisba\Downloads>cd forge >C:\Users\naisba\Downloads\forge>SET "JAVA_HOME=C:\Users\naisba\Downloads\jdk\" >C:\Users\naisba\Downloads\forge>SET JAVA_EXE=%JAVA_HOME%\bin\java.exe >C:\Users\naisba\Downloads\forge>SET PATH=%JAVA_HOME%\bin\;%PATH% >C:\Users\naisba\Downloads\forge>gradlew build >**************************** > Powered By MCP:              > http://mcp.ocean-labs.de/    > Searge, ProfMobius, Fesh0r,  > R4wk, ZeuX, IngisKahn, bspkrs > MCP Data version : unknown >**************************** >FAILURE: Build failed with an exception. >* What went wrong: >A problem occurred configuring root project 'forge'. >> java.lang.IllegalStateException: Expected BEGIN_OBJECT but was STRING at line 1 column 1 >* Try: >Run with --stacktrace option to get the stack trace. Run with --info or --debug option to get more log output. >BUILD FAILED >Total time: 13.979 secs >C:\Users\naisba\Downloads\forge> >Task completed with return code 0 in 15030 milliseconds >Task return code check OK!