Error with launching of client

Started by igor2 on Wed, 03/04/2015 - 09:19
Last seen on 19:24, 27. Jun 2018
Joined Dec 2013
User points:

Statistics:

  • Comments:
  • Forum topics:
  • Modifications:
  • Wiki pages:
Error with launching of client
Wed, 03/04/2015 - 09:19

Hello.My name is igor2,and I can't launch client.Always when I try do it,MCreator instantly close Minecraft window and write this error:

 

>C:\Pylo\MCreator154\forge\build\sources\java\mod\mcreator\TestEnvironmentMod.java:109: error: cannot find symbol >mcreator_ternoteumDirt mcreator_1 = new mcreator_ternoteumDirt(); >^ >  symbol:   class mcreator_ternoteumDirt >  location: class TestEnvironmentMod >C:\Pylo\MCreator154\forge\build\sources\java\mod\mcreator\TestEnvironmentMod.java:109: error: cannot find symbol >mcreator_ternoteumDirt mcreator_1 = new mcreator_ternoteumDirt(); >                                        ^ >  symbol:   class mcreator_ternoteumDirt >  location: class TestEnvironmentMod >Note: C:\Pylo\MCreator154\forge\build\sources\java\mcreator_ternoland.java uses or overrides a deprecated API. >2 errors >:compileJava FAILED >FAILURE: Build failed with an exception. >* What went wrong: >BUILD FAILED >Execution failed for task ':>> Compilation>Total time: 7.267 secs  failed; see the compiler error output for details. compileJava'.   HELP ME!IT'S A VERY IMPORTANT,WITHOUT THIS I CAN'T TEST THE MOD!PLEASE!   -igor2
Last seen on 19:24, 27. Jun 2018
Joined Dec 2013
User points:

Statistics:

  • Comments:
  • Forum topics:
  • Modifications:
  • Wiki pages:
If you can help me anyway
Wed, 03/04/2015 - 09:21

If you can help me anyway,please,anwser!

Last seen on 19:24, 27. Jun 2018
Joined Dec 2013
User points:

Statistics:

  • Comments:
  • Forum topics:
  • Modifications:
  • Wiki pages:
Coo.
Wed, 03/04/2015 - 09:28

Coo.

Last seen on 01:27, 7. Apr 2017
Joined Jan 2014
User points:

Statistics:

  • Comments:
  • Forum topics:
  • Modifications:
  • Wiki pages:
Okay I looked at this and I
Wed, 03/04/2015 - 15:07

Okay I looked at this and I think it has something to do with a custom block you have that caused 1 of 2 errors.

Last seen on 19:05, 25. Feb 2017
Joined Jan 2015
User points:

Statistics:

  • Comments:
  • Forum topics:
  • Modifications:
  • Wiki pages:
Delete the "TernoteumDirt"
Wed, 03/04/2015 - 21:48

Delete the "TernoteumDirt" and re do it.This should work