Please help minecraft test issues

Started by rogocraft on Tue, 03/10/2015 - 01:38
Last seen on 16:17, 23. Oct 2016
Joined Jan 2015
User points:

Statistics:

  • Comments:
  • Forum topics:
  • Modifications:
  • Wiki pages:
Please help minecraft test issues
Tue, 03/10/2015 - 01:38

hello i recently am having problems with my mod when i want to use it in the minecraft test version it gives me a error like this:

C:\Pylo\MCreator155\forge\build\sources\java\mod\mcreator\mcreator_GlobalEventsRandom O' Craft.java:133: error: '{' expected public class mcreator_GlobalEventsRandom O' Craft{                                         ^ C:\Pylo\MCreator155\forge\build\sources\java\mod\mcreator\mcreator_GlobalEventsRandom O' Craft.java:133: error: unclosed character literal public class mcreator_GlobalEventsRandom O' Craft{                                           ^ C:\Pylo\MCreator155\forge\build\sources\java\mod\mcreator\mcreator_VarListRandom O' Craft.java:3: error: '{' expected public class mcreator_VarListRandom O' Craft{                                    ^ C:\Pylo\MCreator155\forge\build\sources\java\mod\mcreator\mcreator_VarListRandom O' Craft.java:3: error: unclosed character literal public class mcreator_VarListRandom O' Craft{                                      ^ 4 errors   FAILURE: Build failed with an exception.   * What went wrong: Execution failed for task ':compileJava'. > Compilation failed; see the compiler error output for details.   * Try: Run with --stacktrace option to get the stack trace. Run with --info or --debug option to get more log output.   here is the mod if somebody will help me! https://www.mediafire.com/?acrgscm1scg1174
Last seen on 20:39, 17. Mar 2017
Joined Feb 2015
User points:

Statistics:

  • Comments:
  • Forum topics:
  • Modifications:
  • Wiki pages:
It looks like your Variables
Thu, 03/12/2015 - 18:20

It looks like your Variables and Global Events are messing it up. This is pretty common as its hard to get them just right.