will not export

Started by monkeybrine on Tue, 03/17/2015 - 17:11
Last seen on 19:52, 26. Jun 2015
Joined Mar 2015
User points:

Statistics:

  • Comments:
  • Forum topics:
  • Modifications:
  • Wiki pages:
will not export
Tue, 03/17/2015 - 17:11

so i am making my first mod, everything seems perfect, but i cannot export it! i press export, do everything, and the program closes, and there is no mod file on my desktop where i told it to go! heeeeelp! :(

Last seen on 14:47, 29. Jul 2017
Joined Dec 2014
User points:

Statistics:

  • Comments:
  • Forum topics:
  • Modifications:
  • Wiki pages:
Same For Me!Using 1.5.5?
Tue, 03/17/2015 - 17:16

Same For Me!Using 1.5.5?

Last seen on 19:52, 26. Jun 2015
Joined Mar 2015
User points:

Statistics:

  • Comments:
  • Forum topics:
  • Modifications:
  • Wiki pages:
RE:Same For Me!Using 1.5.5?
Tue, 03/17/2015 - 17:22

@#1 yep

Last seen on 14:47, 29. Jul 2017
Joined Dec 2014
User points:

Statistics:

  • Comments:
  • Forum topics:
  • Modifications:
  • Wiki pages:
Mc Told Me To Try To Export
Tue, 03/17/2015 - 18:06

Mc Told Me To Try To Export As .zip

Last seen on 14:47, 29. Jul 2017
Joined Dec 2014
User points:

Statistics:

  • Comments:
  • Forum topics:
  • Modifications:
  • Wiki pages:
RE:Mc Told Me To Try To Export
Tue, 03/17/2015 - 18:07

@#2 Oh Okay That Doesn't Work....

Last seen on 07:13, 25. Jul 2016
Joined Apr 2015
User points:

Statistics:

  • Comments:
  • Forum topics:
  • Modifications:
  • Wiki pages:
I am having the exact same
Mon, 04/06/2015 - 06:06

I am having the exact same problem.

Last seen on 03:28, 8. Dec 2015
Joined Apr 2015
User points:

Statistics:

  • Comments:
  • Forum topics:
  • Modifications:
  • Wiki pages:
Same problem here. I go to
Sat, 04/11/2015 - 23:21

Same problem here. I go to export, I put in the file name, name the mod, put in the description, save as a zip and the program just closes. No file.

Last seen on 12:58, 11. Dec 2015
Joined Apr 2015
User points:

Statistics:

  • Comments:
  • Forum topics:
  • Modifications:
  • Wiki pages:
Go into where your MCreator
Thu, 04/23/2015 - 21:09

Go into where your MCreator is saved on disk *ie. C:\Pylo\MCreator* go into the forge file then open the .gradle file and open the txt file gradle and post the either the hole thing or the last 10-20 ish lines

Also when exporting make a name for the file and chose the location then for the Mod Details:----------- Mod Name DO NOT PUT ANY SPACES in it I did it a few times and got errors and it closing on me also. version and author file anyway Mod Image may also be a cause if to big not sure Still new to MCreator only started using it on April 21ish 2015

Last seen on 19:51, 6. Jun 2015
Joined Jun 2015
User points:

Statistics:

  • Comments:
  • Forum topics:
  • Modifications:
  • Wiki pages:
19062scott Ender Eye it
Sat, 06/06/2015 - 14:07

19062scott Ender Eye 
it righted to me that :

 


FAILURE: Build failed with an exception.

* Where:
Build file 'C:\Pylo\MCreator156\forge\build.gradle' line: 18

* What went wrong:
A problem occurred evaluating root project 'forge'.
> java.io.EOFException: End of input at line 19339 column 11

* Try:
Run with --stacktrace option to get the stack trace. Run with --info or --debug option to get more log output.

BUILD FAILED

Total time: 33.461 secs

can you help me ?

 

Last seen on 11:27, 31. Aug 2015
Joined Jun 2015
User points:

Statistics:

  • Comments:
  • Forum topics:
  • Modifications:
  • Wiki pages:
I've exactly the same problem
Mon, 06/29/2015 - 20:56

I've exactly the same problem

>FAILURE: Build failed with an exception.

>* Where:
>Build file 'C:\Pylo\MCreator156\forge\build.gradle' line: 18
>* What went wrong:
>A problem occurred evaluating root project 'forge'.
>> java.lang.IllegalStateException: Expected BEGIN_OBJECT but was STRING at line 1 column 1
>* Try:
>Run with --stacktrace option to get the stack trace. Run with --info or --debug option to get more log output.

Last seen on 12:24, 15. May 2018
Joined May 2018
User points:

Statistics:

  • Comments:
  • Forum topics:
  • Modifications:
  • Wiki pages:
This is what i got    ******…
Sun, 05/13/2018 - 21:49

This is what i got 

 

****************************
 Powered By MCP:             
 http://modcoderpack.com/    
 Searge, ProfMobius, Fesh0r, 
 R4wk, ZeuX, IngisKahn, bspkrs
 MCP Data version : unknown
****************************
:compileApiJava UP-TO-DATE
:processApiResources UP-TO-DATE
:apiClasses UP-TO-DATE
:sourceMainJava

FAILURE: Build failed with an exception.

* What went wrong:
java.io.FileNotFoundException: C:\Pylo\MCreator173\forge\.gradle\2.0\taskArtifacts\cache.properties (The system cannot find the file specified)
> C:\Pylo\MCreator173\forge\.gradle\2.0\taskArtifacts\cache.properties (The system cannot find the file specified)

* Try:
Run with --stacktrace option to get the stack trace. Run with --info or --debug option to get more log output.

BUILD FAILED

Total time: 28.437 secs