Build problem

Started by TheNicolasM9 on Fri, 04/17/2015 - 14:00
Last seen on 13:01, 8. Jan 2017
Joined Apr 2014
User points:

Statistics:

  • Comments:
  • Forum topics:
  • Modifications:
  • Wiki pages:
Build problem
Fri, 04/17/2015 - 14:03 (edited)

I everybody,

I have a problem when i try to build a mod so i can't to anything. I hope you can help me guys !

---------------------------------------------------------------------------------------------------------------------------------------------

>Executing gradle command: build >Microsoft Windows [version 6.2.9200] >(c) 2012 Microsoft Corporation. Tous droits r‚serv‚s. >D:\MCreator>cd forge >D:\MCreator\forge>SET "JAVA_HOME=D:\MCreator\jdk\" >D:\MCreator\forge>SET JAVA_EXE=%JAVA_HOME%\bin\java.exe >D:\MCreator\forge>SET PATH=%JAVA_HOME%\bin\;%PATH% >D:\MCreator\forge>gradlew build >**************************** > Powered By MCP:              > http://mcp.ocean-labs.de/    > Searge, ProfMobius, Fesh0r,  > R4wk, ZeuX, IngisKahn, bspkrs > MCP Data version : unknown >**************************** >:compileApiJava UP-TO-DATE >:processApiResources UP-TO-DATE >:apiClasses UP-TO-DATE >:sourceMainJava UP-TO-DATE >:compileJava UP-TO-DATE >:processResources UP-TO-DATE >:classes UP-TO-DATE >:jar UP-TO-DATE >:compileTestJava UP-TO-DATE >:processTestResources UP-TO-DATE >:testClasses UP-TO-DATE >:test UP-TO-DATE >:extractMcpData UP-TO-DATE >:getVersionJson >:extractUserDev UP-TO-DATE >:genSrgs SKIPPED >:reobf FAILED >FAILURE: Build failed with an exception. >* What went wrong: >Execution failed for task ':reobf'. >BUILD FAILED >> MALFORMED >Total time: 16.049 secs >* Try: >Run with --stacktrace option to get the stack trace. Run with --info or --debug option to get more log output. >D:\MCreator\forge> >Task completed with return code 0 in 16909 milliseconds >Task return code check OK! ------------------------------------------------------------------------------------------------------------------------------------------------------------------------------------------------------------------
>Executing gradle command: build --info >Microsoft Windows [version 6.2.9200] >(c) 2012 Microsoft Corporation. Tous droits r‚serv‚s. >D:\MCreator>cd forge >D:\MCreator\forge>SET "JAVA_HOME=D:\MCreator\jdk\" >D:\MCreator\forge>SET JAVA_EXE=%JAVA_HOME%\bin\java.exe >D:\MCreator\forge>SET PATH=%JAVA_HOME%\bin\;%PATH% >D:\MCreator\forge>gradlew build --info >Starting Build >Settings evaluated using empty settings script. >Projects loaded. Root project using build file 'D:\MCreator\forge\build.gradle'. >Included projects: [root project 'forge'] >Evaluating root project 'forge' using build file 'D:\MCreator\forge\build.gradle'. >**************************** > Powered By MCP:              > http://mcp.ocean-labs.de/    > Searge, ProfMobius, Fesh0r,  > R4wk, ZeuX, IngisKahn, bspkrs > MCP Data version : unknown >**************************** >All projects evaluated. >Selected primary task 'DefaultTaskParameter{taskName='build',projectPath='null'}' >Tasks to be executed: [task ':compileApiJava', task ':processApiResources', task ':apiClasses', task ':sourceMainJava', task ':compileJava', task ':processResources', task ':classes', task ':jar', task ':compileTestJava', task ':processTestResources', task ':testClasses', task ':test', task ':extractMcpData', task ':getVersionJson', task ':extractUserDev', task ':genSrgs', task ':reobf', task ':assemble', task ':check', task ':build'] >:compileApiJava (Thread[main,5,main]) started. >:compileApiJava >Skipping task ':compileApiJava' as it has no source files. >:compileApiJava UP-TO-DATE >:compileApiJava (Thread[main,5,main]) completed. Took 0.064 secs. >:processApiResources (Thread[main,5,main]) started. >:processApiResources >Skipping task ':processApiResources' as it has no source files. >:processApiResources UP-TO-DATE >:processApiResources (Thread[main,5,main]) completed. Took 0.005 secs. >:apiClasses (Thread[main,5,main]) started. >:apiClasses >Skipping task ':apiClasses' as it has no actions. >:apiClasses UP-TO-DATE >:apiClasses (Thread[main,5,main]) completed. Took 0.005 secs. >:sourceMainJava (Thread[main,5,main]) started. >:sourceMainJava >Skipping task ':sourceMainJava' as it is up-to-date (took 0.142 secs). >:sourceMainJava UP-TO-DATE >:sourceMainJava (Thread[main,5,main]) completed. Took 0.147 secs. >:compileJava (Thread[main,5,main]) started. >:compileJava >Failed to get resource: GET. [HTTP HTTP/1.1 403 Forbidden: https://libraries.minecraft.net//forgeSrc/1.7.10-10.13.2.1230/forgeSrc-…] >Failed to get resource: GET. [HTTP HTTP/1.1 403 Forbidden: https://libraries.minecraft.net/org/scala-lang/scala-parser-combinators…] >Failed to get resource: GET. [HTTP HTTP/1.1 403 Forbidden: https://libraries.minecraft.net/org/scala-lang/scala-swing_2.11/1.0.1/s…] >Failed to get resource: GET. [HTTP HTTP/1.1 403 Forbidden: https://libraries.minecraft.net/org/scala-lang/scala-xml_2.11/1.0.2/sca…] >file or directory 'D:\MCreator\forge\libs', not found >Skipping task ':compileJava' as it is up-to-date (took 3.566 secs). >:compileJava UP-TO-DATE >:compileJava (Thread[main,5,main]) completed. Took 3.624 secs. >:processResources (Thread[main,5,main]) started. >:processResources >Skipping task ':processResources' as it is up-to-date (took 0.053 secs). >:processResources UP-TO-DATE >:processResources (Thread[main,5,main]) completed. Took 0.071 secs. >:classes (Thread[main,5,main]) started. >:classes >Skipping task ':classes' as it has no actions. >:classes UP-TO-DATE >:classes (Thread[main,5,main]) completed. Took 0.003 secs. >:jar (Thread[main,5,main]) started. >:jar >Skipping task ':jar' as it is up-to-date (took 0.078 secs). >:jar UP-TO-DATE >:jar (Thread[main,5,main]) completed. Took 0.089 secs. >:compileTestJava (Thread[main,5,main]) started. >:compileTestJava >Skipping task ':compileTestJava' as it has no source files. >:compileTestJava UP-TO-DATE >:compileTestJava (Thread[main,5,main]) completed. Took 0.001 secs. >:processTestResources (Thread[main,5,main]) started. >:processTestResources >Skipping task ':processTestResources' as it has no source files. >:processTestResources UP-TO-DATE >:processTestResources (Thread[main,5,main]) completed. Took 0.003 secs. >:testClasses (Thread[main,5,main]) started. >:testClasses >Skipping task ':testClasses' as it has no actions. >:testClasses UP-TO-DATE >:testClasses (Thread[main,5,main]) completed. Took 0.002 secs. >:test (Thread[main,5,main]) started. >:test >file or directory 'D:\MCreator\forge\build\classes\test', not found >Skipping task ':test' as it has no source files. >:test UP-TO-DATE >:test (Thread[main,5,main]) completed. Took 0.006 secs. >:extractMcpData (Thread[main,5,main]) started. >:extractMcpData >Skipping task ':extractMcpData' as it is up-to-date (took 0.008 secs). >:extractMcpData UP-TO-DATE >:extractMcpData (Thread[main,5,main]) completed. Took 0.013 secs. >:getVersionJson (Thread[main,5,main]) started. >:getVersionJson >Executing task ':getVersionJson' (up-to-date check took 0.002 secs) due to: >  Task has not declared any outputs. >:getVersionJson (Thread[main,5,main]) completed. Took 0.329 secs. >:extractUserDev (Thread[main,5,main]) started. >:extractUserDev >Failed to get resource: GET. [HTTP HTTP/1.1 403 Forbidden: https://libraries.minecraft.net/net/minecraftforge/forge/1.7.10-10.13.2…] >Skipping task ':extractUserDev' as it is up-to-date (took 1.242 secs). >:extractUserDev UP-TO-DATE >:extractUserDev (Thread[main,5,main]) completed. Took 1.247 secs. >:genSrgs (Thread[main,5,main]) started. >:genSrgs >Skipping task ':genSrgs' as task onlyIf is false. >:genSrgs SKIPPED >:genSrgs (Thread[main,5,main]) completed. Took 0.92 secs. >:reobf (Thread[main,5,main]) started. >:reobf >Executing task ':reobf' (up-to-date check took 0.096 secs) due to: >  Output file D:\MCreator\forge\build\libs\modid-1.0.jar has changed. >:reobf FAILED >:reobf (Thread[main,5,main]) completed. Took 2.159 secs. >FAILURE: Build failed with an exception. >* What went wrong: >Execution failed for task ':reobf'. >> MALFORMED >BUILD FAILED >* Try: >Run with --stacktrace option to get the stack trace. Run with --debug option to get more log output. >Total time: 21.35 secs >D:\MCreator\forge> >Task completed with return code 0 in 22051 milliseconds >Task return code check OK! ------------------------------------------------------------------------------------------------------------------------------------------------------------------------------------------ >Executing gradle command: build --stacktrace --info >Microsoft Windows [version 6.2.9200] >(c) 2012 Microsoft Corporation. Tous droits r‚serv‚s. >D:\MCreator>cd forge >D:\MCreator\forge>SET "JAVA_HOME=D:\MCreator\jdk\" >D:\MCreator\forge>SET JAVA_EXE=%JAVA_HOME%\bin\java.exe >D:\MCreator\forge>SET PATH=%JAVA_HOME%\bin\;%PATH% >D:\MCreator\forge>gradlew build --stacktrace --info >Starting Build >Settings evaluated using empty settings script. >Projects loaded. Root project using build file 'D:\MCreator\forge\build.gradle'. >Included projects: [root project 'forge'] >Evaluating root project 'forge' using build file 'D:\MCreator\forge\build.gradle'. >**************************** > Powered By MCP:              > http://mcp.ocean-labs.de/    > Searge, ProfMobius, Fesh0r,  > R4wk, ZeuX, IngisKahn, bspkrs > MCP Data version : unknown >**************************** >All projects evaluated. >Selected primary task 'DefaultTaskParameter{taskName='build',projectPath='null'}' >Tasks to be executed: [task ':compileApiJava', task ':processApiResources', task ':apiClasses', task ':sourceMainJava', task ':compileJava', task ':processResources', task ':classes', task ':jar', task ':compileTestJava', task ':processTestResources', task ':testClasses', task ':test', task ':extractMcpData', task ':getVersionJson', task ':extractUserDev', task ':genSrgs', task ':reobf', task ':assemble', task ':check', task ':build'] >:compileApiJava (Thread[main,5,main]) started. >:compileApiJava >Skipping task ':compileApiJava' as it has no source files. >:compileApiJava UP-TO-DATE >:compileApiJava (Thread[main,5,main]) completed. Took 0.03 secs. >:processApiResources (Thread[main,5,main]) started. >:processApiResources >Skipping task ':processApiResources' as it has no source files. >:processApiResources UP-TO-DATE >:processApiResources (Thread[main,5,main]) completed. Took 0.003 secs. >:apiClasses (Thread[main,5,main]) started. >:apiClasses >Skipping task ':apiClasses' as it has no actions. >:apiClasses UP-TO-DATE >:apiClasses (Thread[main,5,main]) completed. Took 0.009 secs. >:sourceMainJava (Thread[main,5,main]) started. >:sourceMainJava >Skipping task ':sourceMainJava' as it is up-to-date (took 0.073 secs). >:sourceMainJava UP-TO-DATE >:sourceMainJava (Thread[main,5,main]) completed. Took 0.101 secs. >:compileJava (Thread[main,5,main]) started. >:compileJava >Failed to get resource: GET. [HTTP HTTP/1.1 403 Forbidden: https://libraries.minecraft.net//forgeSrc/1.7.10-10.13.2.1230/forgeSrc-…] >Failed to get resource: GET. [HTTP HTTP/1.1 403 Forbidden: https://libraries.minecraft.net/org/scala-lang/scala-parser-combinators…] >Failed to get resource: GET. [HTTP HTTP/1.1 403 Forbidden: https://libraries.minecraft.net/org/scala-lang/scala-swing_2.11/1.0.1/s…] >Failed to get resource: GET. [HTTP HTTP/1.1 403 Forbidden: https://libraries.minecraft.net/org/scala-lang/scala-xml_2.11/1.0.2/sca…] >file or directory 'D:\MCreator\forge\libs', not found >Skipping task ':compileJava' as it is up-to-date (took 1.895 secs). >:compileJava UP-TO-DATE >:compileJava (Thread[main,5,main]) completed. Took 1.904 secs. >:processResources (Thread[main,5,main]) started. >:processResources >Skipping task ':processResources' as it is up-to-date (took 0.059 secs). >:processResources UP-TO-DATE >:processResources (Thread[main,5,main]) completed. Took 0.079 secs. >:classes (Thread[main,5,main]) started. >:classes >Skipping task ':classes' as it has no actions. >:classes UP-TO-DATE >:classes (Thread[main,5,main]) completed. Took 0.004 secs. >:jar (Thread[main,5,main]) started. >:jar >Skipping task ':jar' as it is up-to-date (took 0.059 secs). >:jar UP-TO-DATE >:jar (Thread[main,5,main]) completed. Took 0.071 secs. >:compileTestJava (Thread[main,5,main]) started. >:compileTestJava >Skipping task ':compileTestJava' as it has no source files. >:compileTestJava UP-TO-DATE >:compileTestJava (Thread[main,5,main]) completed. Took 0.003 secs. >:processTestResources (Thread[main,5,main]) started. >:processTestResources >Skipping task ':processTestResources' as it has no source files. >:processTestResources UP-TO-DATE >:processTestResources (Thread[main,5,main]) completed. Took 0.004 secs. >:testClasses (Thread[main,5,main]) started. >:testClasses >Skipping task ':testClasses' as it has no actions. >:testClasses UP-TO-DATE >:testClasses (Thread[main,5,main]) completed. Took 0.001 secs. >:test (Thread[main,5,main]) started. >:test >file or directory 'D:\MCreator\forge\build\classes\test', not found >Skipping task ':test' as it has no source files. >:test UP-TO-DATE >:test (Thread[main,5,main]) completed. Took 0.006 secs. >:extractMcpData (Thread[main,5,main]) started. >:extractMcpData >Skipping task ':extractMcpData' as it is up-to-date (took 0.01 secs). >:extractMcpData UP-TO-DATE >:extractMcpData (Thread[main,5,main]) completed. Took 0.015 secs. >:getVersionJson (Thread[main,5,main]) started. >:getVersionJson >Executing task ':getVersionJson' (up-to-date check took 0.003 secs) due to: >  Task has not declared any outputs. >:getVersionJson (Thread[main,5,main]) completed. Took 0.383 secs. >:extractUserDev (Thread[main,5,main]) started. >:extractUserDev >Failed to get resource: GET. [HTTP HTTP/1.1 403 Forbidden: https://libraries.minecraft.net/net/minecraftforge/forge/1.7.10-10.13.2…] >Skipping task ':extractUserDev' as it is up-to-date (took 0.893 secs). >:extractUserDev UP-TO-DATE >:extractUserDev (Thread[main,5,main]) completed. Took 0.896 secs. >:genSrgs (Thread[main,5,main]) started. >:genSrgs >Skipping task ':genSrgs' as task onlyIf is false. >:genSrgs SKIPPED >:genSrgs (Thread[main,5,main]) completed. Took 0.835 secs. >:reobf (Thread[main,5,main]) started. >:reobf >Executing task ':reobf' (up-to-date check took 0.062 secs) due to: >  Output file D:\MCreator\forge\build\libs\modid-1.0.jar has changed. >:reobf FAILED >:reobf (Thread[main,5,main]) completed. Took 2.38 secs. >FAILURE: Build failed with an exception. >* What went wrong: >Execution failed for task ':reobf'. >> MALFORMED >* Try: >Run with --debug option to get more log output. >* Exception is: >org.gradle.api.tasks.TaskExecutionException: Execution failed for task ':reobf'. > at org.gradle.api.internal.tasks.execution.ExecuteActionsTaskExecuter.executeActions(ExecuteActionsTaskExecuter.java:69) > at org.gradle.api.internal.tasks.execution.ExecuteActionsTaskExecuter.execute(ExecuteActionsTaskExecuter.java:46) > at org.gradle.api.internal.tasks.execution.PostExecutionAnalysisTaskExecuter.execute(PostExecutionAnalysisTaskExecuter.java:35) > at org.gradle.api.internal.tasks.execution.SkipUpToDateTaskExecuter.execute(SkipUpToDateTaskExecuter.java:64) > at org.gradle.api.internal.tasks.execution.ValidatingTaskExecuter.execute(ValidatingTaskExecuter.java:58) > at org.gradle.api.internal.tasks.execution.SkipEmptySourceFilesTaskExecuter.execute(SkipEmptySourceFilesTaskExecuter.java:42) > at org.gradle.api.internal.tasks.execution.SkipTaskWithNoActionsExecuter.execute(SkipTaskWithNoActionsExecuter.java:52) > at org.gradle.api.internal.tasks.execution.SkipOnlyIfTaskExecuter.execute(SkipOnlyIfTaskExecuter.java:53) > at org.gradle.api.internal.tasks.execution.ExecuteAtMostOnceTaskExecuter.execute(ExecuteAtMostOnceTaskExecuter.java:43) > at org.gradle.api.internal.AbstractTask.executeWithoutThrowingTaskFailure(AbstractTask.java:296) > at org.gradle.execution.taskgraph.AbstractTaskPlanExecutor$TaskExecutorWorker.executeTask(AbstractTaskPlanExecutor.java:79) > at org.gradle.execution.taskgraph.AbstractTaskPlanExecutor$TaskExecutorWorker.processTask(AbstractTaskPlanExecutor.java:63) > at org.gradle.execution.taskgraph.AbstractTaskPlanExecutor$TaskExecutorWorker.run(AbstractTaskPlanExecutor.java:51) > at org.gradle.execution.taskgraph.DefaultTaskPlanExecutor.process(DefaultTaskPlanExecutor.java:23) > at org.gradle.execution.taskgraph.DefaultTaskGraphExecuter.execute(DefaultTaskGraphExecuter.java:86) > at org.gradle.execution.SelectedTaskExecutionAction.execute(SelectedTaskExecutionAction.java:29) > at org.gradle.execution.DefaultBuildExecuter.execute(DefaultBuildExecuter.java:61) > at org.gradle.execution.DefaultBuildExecuter.access$200(DefaultBuildExecuter.java:23) > at org.gradle.execution.DefaultBuildExecuter$2.proceed(DefaultBuildExecuter.java:67) > at org.gradle.execution.DryRunBuildExecutionAction.execute(DryRunBuildExecutionAction.java:32) > at org.gradle.execution.DefaultBuildExecuter.execute(DefaultBuildExecuter.java:61) > at org.gradle.execution.DefaultBuildExecuter.execute(DefaultBuildExecuter.java:54) > at org.gradle.initialization.DefaultGradleLauncher.doBuildStages(DefaultGradleLauncher.java:148) > at org.gradle.initialization.DefaultGradleLauncher.doBuild(DefaultGradleLauncher.java:105) > at org.gradle.initialization.DefaultGradleLauncher.run(DefaultGradleLauncher.java:85) > at org.gradle.launcher.exec.InProcessBuildActionExecuter$DefaultBuildController.run(InProcessBuildActionExecuter.java:81) > at org.gradle.launcher.cli.ExecuteBuildAction.run(ExecuteBuildAction.java:33) > at org.gradle.launcher.cli.ExecuteBuildAction.run(ExecuteBuildAction.java:24) > at org.gradle.launcher.exec.InProcessBuildActionExecuter.execute(InProcessBuildActionExecuter.java:39) > at org.gradle.launcher.exec.InProcessBuildActionExecuter.execute(InProcessBuildActionExecuter.java:29) > at org.gradle.launcher.cli.RunBuildAction.run(RunBuildAction.java:50) > at org.gradle.internal.Actions$RunnableActionAdapter.execute(Actions.java:171) > at org.gradle.launcher.cli.CommandLineActionFactory$ParseAndBuildAction.execute(CommandLineActionFactory.java:237) > at org.gradle.launcher.cli.CommandLineActionFactory$ParseAndBuildAction.execute(CommandLineActionFactory.java:210) > at org.gradle.launcher.cli.JavaRuntimeValidationAction.execute(JavaRuntimeValidationAction.java:35) > at org.gradle.launcher.cli.JavaRuntimeValidationAction.execute(JavaRuntimeValidationAction.java:24) > at org.gradle.launcher.cli.CommandLineActionFactory$WithLogging.execute(CommandLineActionFactory.java:206) > at org.gradle.launcher.cli.CommandLineActionFactory$WithLogging.execute(CommandLineActionFactory.java:169) > at org.gradle.launcher.cli.ExceptionReportingAction.execute(ExceptionReportingAction.java:33) > at org.gradle.launcher.cli.ExceptionReportingAction.execute(ExceptionReportingAction.java:22) > at org.gradle.launcher.Main.doAction(Main.java:33) > at org.gradle.launcher.bootstrap.EntryPoint.run(EntryPoint.java:45) > at org.gradle.launcher.bootstrap.ProcessBootstrap.runNoExit(ProcessBootstrap.java:54) > at org.gradle.launcher.bootstrap.ProcessBootstrap.run(ProcessBootstrap.java:35) > at org.gradle.launcher.GradleMain.main(GradleMain.java:23) > at org.gradle.wrapper.BootstrapMainStarter.start(BootstrapMainStarter.java:30) > at org.gradle.wrapper.WrapperExecutor.execute(WrapperExecutor.java:127) > at org.gradle.wrapper.GradleWrapperMain.main(GradleWrapperMain.java:56) >Caused by: java.lang.IllegalArgumentException: MALFORMED > at net.md_5.specialsource.Jar.collectJarFiles(Jar.java:169) > at net.md_5.specialsource.Jar.init(Jar.java:229) > at net.md_5.specialsource.Jar.init(Jar.java:206) > at net.minecraftforge.gradle.tasks.user.reobf.ObfArtifact.applySpecialSource(ObfArtifact.java:387) > at net.minecraftforge.gradle.tasks.user.reobf.ObfArtifact.generate(ObfArtifact.java:350) > at net.minecraftforge.gradle.tasks.user.reobf.ReobfTask.doTask(ReobfTask.java:317) > at org.gradle.internal.reflect.JavaMethod.invoke(JavaMethod.java:63) > at org.gradle.api.internal.project.taskfactory.AnnotationProcessingTaskFactory$StandardTaskAction.doExecute(AnnotationProcessingTaskFactory.java:218) > at org.gradle.api.internal.project.taskfactory.AnnotationProcessingTaskFactory$StandardTaskAction.execute(AnnotationProcessingTaskFactory.java:211) > at org.gradle.api.internal.project.taskfactory.AnnotationProcessingTaskFactory$StandardTaskAction.execute(AnnotationProcessingTaskFactory.java:200) > at org.gradle.api.internal.AbstractTask$TaskActionWrapper.execute(AbstractTask.java:570) > at org.gradle.api.internal.AbstractTask$TaskActionWrapper.execute(AbstractTask.java:553) > at org.gradle.api.internal.tasks.execution.ExecuteActionsTaskExecuter.executeAction(ExecuteActionsTaskExecuter.java:80) > at org.gradle.api.internal.tasks.execution.ExecuteActionsTaskExecuter.executeActions(ExecuteActionsTaskExecuter.java:61) > ... 47 more >BUILD FAILED >Total time: 15.709 secs >D:\MCreator\forge> >Task completed with return code 0 in 16435 milliseconds >Task return code check OK!  
Edited by TheNicolasM9 on Fri, 04/17/2015 - 14:03