i Cant start test minecraft client environment

Started by Moking1336 on Wed, 04/22/2015 - 00:54
Last seen on 01:53, 9. May 2017
Joined Nov 2014
User points:

Statistics:

  • Comments:
  • Forum topics:
  • Modifications:
  • Wiki pages:
i Cant start test minecraft client environment
Wed, 04/22/2015 - 00:54

I CANT TEST MY GAME HERES WHAT HAPPENS btw i removed my name with Name

 

>=========================================================================================================================

>Executing gradle command: runClient >Microsoft Windows [Version 6.2.9200] >(c) 2012 Microsoft Corporation. All rights reserved. >C:\Users\Name\Desktop\MCreator 1.5.5 [1.7.10]>cd forge >C:\Users\Name\Desktop\MCreator 1.5.5 [1.7.10]\forge>SET "JAVA_HOME=C:\Users\Name\Desktop\MCreator 1.5.5 [1.7.10]\jdk\" >C:\Users\Name\Desktop\MCreator 1.5.5 [1.7.10]\forge>SET JAVA_EXE=%JAVA_HOME%\bin\java.exe >C:\Users\Name\Desktop\MCreator 1.5.5 [1.7.10]\forge>SET PATH=%JAVA_HOME%\bin\;%PATH% >C:\Users\Name\Desktop\MCreator 1.5.5 [1.7.10]\forge>gradlew runClient >**************************** > Powered By MCP:              > http://mcp.ocean-labs.de/    > Searge, ProfMobius, Fesh0r,  > R4wk, ZeuX, IngisKahn, bspkrs > MCP Data version : unknown >**************************** >:downloadClient >FAILURE: Build failed with an exception. >* What went wrong: >java.io.FileNotFoundException: C:\Users\Name\Desktop\MCreator 1.5.5 [1.7.10]\forge\.gradle\2.0\taskArtifacts\cache.properties (The system cannot find the file specified) >> C:\Users\Name\Desktop\MCreator 1.5.5 [1.7.10]\forge\.gradle\2.0\taskArtifacts\cache.properties (The system cannot find the file specified) >* Try: >Run with --stacktrace option to get the stack trace. Run with --info or --debug option to get more log output. >BUILD FAILED >Total time: 16.854 secs >C:\Users\Name\Desktop\MCreator 1.5.5 [1.7.10]\forge> >Task completed with return code 0 in 17782 milliseconds >Task return code check OK!       Please help---------------------------------
Last seen on 00:06, 1. Oct 2016
Joined Apr 2015
User points:

Statistics:

  • Comments:
  • Forum topics:
  • Modifications:
  • Wiki pages:
I have this problem too
Wed, 04/22/2015 - 18:58

I have this problem too

Last seen on 14:26, 10. May 2015
Joined Apr 2015
User points:

Statistics:

  • Comments:
  • Forum topics:
  • Modifications:
  • Wiki pages:
goto > C:\Users\\Desktop
Thu, 04/23/2015 - 06:02

goto > C:\Users\\Desktop\MCreator 1.5.5 [1.7.10]\forge\.gradle\2.0\taskArtifacts\

and add the file

cache.properties

Leave it empty and try recompile.

Last seen on 10:39, 6. Apr 2016
Joined Apr 2016
User points:

Statistics:

  • Comments:
  • Forum topics:
  • Modifications:
  • Wiki pages:
Im on a mac and if i open
Sun, 04/03/2016 - 20:09

Im on a mac and if i open gradle theres only a wrapper and no 2.0 neither any taskArtifacts :/