Help forge gradle error

Started by MrRm1000 on Wed, 05/06/2015 - 03:21
Last seen on 17:40, 28. Apr 2016
Joined May 2015
User points:

Statistics:

  • Comments:
  • Forum topics:
  • Modifications:
  • Wiki pages:
Help forge gradle error
Thu, 05/07/2015 - 00:33 (edited)
FAILURE: Build failed with an exception.   * Where: Build file 'C:\Pylo\MCreator156\forge\build.gradle' line: 18   * What went wrong: A problem occurred evaluating root project 'forge'. > java.io.EOFException: End of input at line 8413 column 11   * Try: Run with --stacktrace option to get the stack trace. Run with --info or --debug option to get more log output.   BUILD FAILED   Total time: 15.265 secs  
Edited by MrRm1000 on Thu, 05/07/2015 - 00:33
Last seen on 15:31, 15. Nov 2015
Joined Dec 2014
User points:

Statistics:

  • Comments:
  • Forum topics:
  • Modifications:
  • Wiki pages:
Same here...
Sun, 11/15/2015 - 14:05

Same here...