Cannot find the file specified

Started by FluffyGamm on Fri, 05/22/2015 - 04:38
Last seen on 08:02, 31. May 2015
Joined May 2015
User points:

Statistics:

  • Comments:
  • Forum topics:
  • Modifications:
  • Wiki pages:
Cannot find the file specified
Fri, 05/22/2015 - 04:38

Ok so I can't run the test environment. I keep getting an error that says cannot find the file specified.

Here is everything i keep getting

>Executing gradle command: runClient
>Microsoft Windows [Version 6.2.9200]
>(c) 2012 Microsoft Corporation. All rights reserved.
>C:\Pylo\MCreator156>cd forge
>C:\Pylo\MCreator156\forge>SET "JAVA_HOME=C:\Pylo\MCreator156\jdk\"
>C:\Pylo\MCreator156\forge>SET JAVA_EXE=%JAVA_HOME%\bin\java.exe
>C:\Pylo\MCreator156\forge>SET PATH=%JAVA_HOME%\bin\;%PATH%
>C:\Pylo\MCreator156\forge>gradlew runClient
>****************************
> Powered By MCP:             
> http://mcp.ocean-labs.de/   
> Searge, ProfMobius, Fesh0r,
> R4wk, ZeuX, IngisKahn, bspkrs
> MCP Data version : unknown
>****************************
>:compileApiJava UP-TO-DATE
>:processApiResources UP-TO-DATE
>:apiClasses UP-TO-DATE
>:sourceMainJava
>FAILURE: Build failed with an exception.
>* What went wrong:
>java.io.FileNotFoundException: C:\Pylo\MCreator156\forge\.gradle\2.0\taskArtifacts\cache.properties (The system cannot find the file specified)
>> C:\Pylo\MCreator156\forge\.gradle\2.0\taskArtifacts\cache.properties (The system cannot find the file specified)
>* Try:
>Run with --stacktrace option to get the stack trace. Run with --info or --debug option to get more log output.
>BUILD FAILED
>Total time: 17.815 secs
>C:\Pylo\MCreator156\forge>
>Task completed with return code 0 in 18721 milliseconds
>Task return code check OK!
>=========================================================================================================================
>Executing gradle command: build
>Microsoft Windows [Version 6.2.9200]
>(c) 2012 Microsoft Corporation. All rights reserved.
>C:\Pylo\MCreator156>cd forge
>C:\Pylo\MCreator156\forge>SET "JAVA_HOME=C:\Pylo\MCreator156\jdk\"
>C:\Pylo\MCreator156\forge>SET JAVA_EXE=%JAVA_HOME%\bin\java.exe
>C:\Pylo\MCreator156\forge>SET PATH=%JAVA_HOME%\bin\;%PATH%
>C:\Pylo\MCreator156\forge>gradlew build
>****************************
> Powered By MCP:             
> http://mcp.ocean-labs.de/   
> Searge, ProfMobius, Fesh0r,
> R4wk, ZeuX, IngisKahn, bspkrs
> MCP Data version : unknown
>****************************
>:compileApiJava UP-TO-DATE
>:processApiResources UP-TO-DATE
>:apiClasses UP-TO-DATE
>:sourceMainJava
>FAILURE: Build failed with an exception.
>* What went wrong:
>BUILD FAILED
>java.io.FileNotFoundException: C:\Pylo\MCreator156\forge\.gradle\2.0\taskArtifacts\cache.properties (The system cannot find the file specified)
>> C:\Pylo\MCreator156\forge\.gradle\2.0\taskArtifacts\cache.properties (The system cannot find the file specified)
>* Try:
>Run with --stacktrace option to get the stack trace. Run with --info or --debug option to get more log output.
>Total time: 18.657 secs
>C:\Pylo\MCreator156\forge>
>Task completed with return code 0 in 20140 milliseconds
>Task return code check OK!

Last seen on 17:04, 14. Nov 2015
Joined Apr 2015
User points:

Statistics:

  • Comments:
  • Forum topics:
  • Modifications:
  • Wiki pages:
I keep getting that too, I
Fri, 05/22/2015 - 05:41

I keep getting that too, I have no idea how to fix it.