NOT WORKING!

Started by MCMonkeyGMx on Sat, 07/18/2015 - 20:00
Last seen on 18:07, 1. Oct 2017
Joined Jan 2015
User points:

Statistics:

  • Comments:
  • Forum topics:
  • Modifications:
  • Wiki pages:
NOT WORKING!
Sat, 07/18/2015 - 20:00

thisis what comes up after I make a new item. It has a Techne model, but I don't know if that's the problem, so I am posting this. It is a normal item, no special commands or things like when you click it in the air:

:clean
:compileApiJava UP-TO-DATE
:processApiResources UP-TO-DATE
:apiClasses UP-TO-DATE
:sourceMainJava
C:\Users\deanryan\Desktop\MCreator157\forge\build\sources\java\mod\mcreator\TestEnvironmentMod.java:110: error: cannot find symbol
mcreator_tokito mcreator_4 = new mcreator_tokito();
^
  symbol:   class mcreator_tokito
  location: class TestEnvironmentMod
C:\Users\deanryan\Desktop\MCreator157\forge\build\sources\java\mod\mcreator\TestEnvironmentMod.java:110: error: cannot find symbol
mcreator_tokito mcreator_4 = new mcreator_tokito();
                                 ^
  symbol:   class mcreator_tokito
  location: class TestEnvironmentMod
2 errors
:compileJava FAILED
FAILURE: Build failed with an exception.
* What went wrong:
Execution failed for task ':compileJava'.
> Compilation failed; see the compiler error output for details.
* Try:
Run with --stacktrace option to get the stack trace. Run with --info or --debug option to get more log output.
BUILD FAILED
Total time: 1 mins 42.08 secs
C:\Users\deanryan\Desktop\MCreator157\forge>
Task completed with return code 0 in 102936 milliseconds

 

Can someone please help me?