Crashing When Exporting

Started by bluedudeltu on Sat, 07/25/2015 - 19:13
Last seen on 17:21, 4. Aug 2015
Joined Apr 2015
User points:

Statistics:

  • Comments:
  • Forum topics:
  • Modifications:
  • Wiki pages:
Crashing When Exporting
Sat, 07/25/2015 - 19:13

I'm Using Windows 10 and when I created a mod i clicked export it waited like 10 sec and turned of how do i fixed it?

Last seen on 17:21, 4. Aug 2015
Joined Apr 2015
User points:

Statistics:

  • Comments:
  • Forum topics:
  • Modifications:
  • Wiki pages:
HELP
Sat, 07/25/2015 - 19:14

HELP

Last seen on 02:00, 1. Feb 2017
Joined Jul 2015
User points:

Statistics:

  • Comments:
  • Forum topics:
  • Modifications:
  • Wiki pages:
the same thing happenes to me
Sun, 07/26/2015 - 03:20

the same thing happenes to me.

Last seen on 19:17, 9. Nov 2015
Joined Jul 2015
User points:

Statistics:

  • Comments:
  • Forum topics:
  • Modifications:
  • Wiki pages:
same thing, but windows 7 sp1
Mon, 07/27/2015 - 14:56

same thing, but windows 7 sp1

[spoiler]i dont know ok[/spoiler]

Last seen on 20:18, 31. Jul 2015
Joined Jul 2015
User points:

Statistics:

  • Comments:
  • Forum topics:
  • Modifications:
  • Wiki pages:
same thing. error log:
Thu, 07/30/2015 - 23:58

same thing. error log:

 

****************************
 Powered By MCP:             
 http://mcp.ocean-labs.de/   
 Searge, ProfMobius, Fesh0r,
 R4wk, ZeuX, IngisKahn, bspkrs
 MCP Data version : snapshot_20141130
****************************
:clean
:downloadClient

FAILURE: Build failed with an exception.

* What went wrong:
java.io.FileNotFoundException: C:\Pylo\MCreator157\forge\.gradle\2.0\taskArtifacts\cache.properties (The system cannot find the file specified)
> C:\Pylo\MCreator157\forge\.gradle\2.0\taskArtifacts\cache.properties (The system cannot find the file specified)

* Try:
Run with --stacktrace option to get the stack trace. Run with --info or --debug option to get more log output.

BUILD FAILED

Total time: 9.323 secs