Error on trying to test mod [1.8 - 1..57]

Started by balejakey123 on Mon, 08/17/2015 - 11:41
Last seen on 14:17, 17. Aug 2015
Joined Dec 2014
User points:

Statistics:

  • Comments:
  • Forum topics:
  • Modifications:
  • Wiki pages:
Error on trying to test mod [1.8 - 1..57]
Mon, 08/17/2015 - 11:41

I get this error when i try to load my mod. [https://drive.google.com/open?id=0B7z9OJwhSb4HZWhzcldoR0I2NmM]

:clean
:downloadClient
:downloadServer
:getVersionJson
:extractUserDev FAILED
FAILURE: Build failed with an exception.
* What went wrong:
Execution failed for task ':extractUserDev'.
> java.util.zip.ZipException: invalid CEN header (bad signature)
BUILD FAILED
* Try:
Total time: 1 mins 25.234 secs
Run with --stacktrace option to get the stack trace. Run with --info or --debug option to get more log output.
E:\Software\MCreator157\forge>
Task completed with return code 0 in 85891 milliseconds
Task return code check OK!