test run fail

Started by bbcraft22 on Fri, 08/21/2015 - 21:29

Topic category: Help with MCreator modding

Last seen on 20:35, 16. May 2017
Joined Jul 2015
User points:


  • Comments:
  • Forum topics:
  • Modifications:
  • Wiki pages:
test run fail
Fri, 08/21/2015 - 21:29

this is what it said


Microsoft Windows [Version 6.3.9600]
(c) 2013 Microsoft Corporation. All rights reserved.
C:\Pylo\MCreator157>cd forge
C:\Pylo\MCreator157\forge>SET "JAVA_HOME=C:\Pylo\MCreator157\jdk\"
C:\Pylo\MCreator157\forge>SET JAVA_EXE=%JAVA_HOME%\bin\java.exe
C:\Pylo\MCreator157\forge>SET PATH=%JAVA_HOME%\bin\;%PATH%
C:\Pylo\MCreator157\forge>gradlew clean build
 Powered By MCP:             
 Searge, ProfMobius, Fesh0r, 
 R4wk, ZeuX, IngisKahn, bspkrs
 MCP Data version : snapshot_20141130
:compileApiJava UP-TO-DATE
:processApiResources UP-TO-DATE
:apiClasses UP-TO-DATE
C:\Pylo\MCreator157\forge\build\sources\java\mod\mcreator\mcreator_crowder.java:152: error: illegal start of expression
this.tasks.addTask(10, new EntityAITempt(this, 0.8D, , false));
1 error
:compileJava FAILED
FAILURE: Build failed with an exception.
* What went wrong:
Execution failed for task ':compileJava'.
> Compilation failed; see the compiler error output for details.
Total time: 5.16 secs
* Try:
Run with --stacktrace option to get the stack trace. Run with --info or --debug option to get more log output.
Task completed with return code 0 in 5731 milliseconds



please help ASAP