bug pls help

Started by LabVillager on Sun, 10/04/2015 - 12:48
Last seen on 13:53, 1. Apr 2017
Joined Sep 2015
User points:

Statistics:

  • Comments:
  • Forum topics:
  • Modifications:
  • Wiki pages:
bug pls help
Sun, 10/04/2015 - 12:48

C:\Pylo\MCreator158\forge\build\sources\java\mod\mcreator\mcreator_purediaomdsword.java:124: error: cannot find symbol
int j = (int)(entity.prevPosY + (entity.posY - entity.prevPosY) * (double)var4 + 1.62D - (double)entity.yOffset);
                                                                                                       ^
  symbol:   variable yOffset
  location: variable entity of type EntityPlayer
C:\Pylo\MCreator158\forge\build\sources\java\mod\mcreator\mcreator_purediaomdsword.java:142: error: method onItemUse in class Item cannot be applied to given types;
super.onItemUse(itemstack, entity, world, i, j, k, l, a, b, c);float var4 = 1.0F;
     ^
  required: ItemStack,EntityPlayer,World,BlockPos,EnumFacing,float,float,float
  found: ItemStack,EntityPlayer,World,int,int,int,int,float,float,float
  reason: actual and formal argument lists differ in length
C:\Pylo\MCreator158\forge\build\sources\java\mod\mcreator\mcreator_purediaomdsword.java:157: error: cannot find symbol
int j = (int)(entity.prevPosY + (entity.posY - entity.prevPosY) * (double)var4 + 1.62D - (double)entity.yOffset);
:compileJava FAILED
                                                                                                       ^
  symbol:   variable yOffset
  location: variable entity of type EntityPlayer
3 errors
FAILURE: Build failed with an exception.
* What went wrong:
Execution failed for task ':compileJava'.
BUILD FAILED
> Compilation failed; see the compiler error output * Try:
for deTotal time: 12.094 secs
tails.
Run with --stacktrace option to get the stack trace. Run with --info or --debug option to get more log output.
C:\Pylo\MCreator158\forge>
Task completed with return code 0 in 12859 milliseconds