No items with events?

Started by Zxartle on Mon, 10/19/2015 - 04:17
Last seen on 02:52, 31. May 2017
Joined Aug 2015
User points:

Statistics:

  • Comments:
  • Forum topics:
  • Modifications:
  • Wiki pages:
No items with events?
Mon, 10/19/2015 - 04:17

I've been having some problems. Whenever I make an item with an event, it says there's an error. Allow me to elaborate; whenever I add an event of any kind onto any item, upon trying to load the test environment it says: 

Recompilation has failed because compiler found errors.

Most likely, this was caused by the last mod you made.

Edit this mod and make sure you fill all the form elements.

There are some other things you can do:

If you still see the message after you do this, remove the mod or some of functionality and try again.

If you can't get rid of this message, export workspace and send it to us so we can try to help you.

Then remove the mod which caused the error.

Click Ignore Errors to ignore this message and fix errors on your own. Click Remove problematic mods if you want MCreator to remove mods listed above. After MCreator will do this, last gradle action will be reinvoked. 

Mods that cause errors:

(name of my mod)


 

 

I've tried exporting it to them as it suggested, but it didn't work.(I've tried many things, but no events work whatsoever) 

Last seen on 02:38, 19. Dec 2017
Joined Sep 2015
User points:

Statistics:

  • Comments:
  • Forum topics:
  • Modifications:
  • Wiki pages:
It sounds like one of the
Mon, 10/19/2015 - 22:21

It sounds like one of the mods you made before this one is messing with these items and events. Go and check through all the other mods and see if there is anything that looks like it could be a conflict and change it.

Last seen on 19:05, 25. Feb 2017
Joined Jan 2015
User points:

Statistics:

  • Comments:
  • Forum topics:
  • Modifications:
  • Wiki pages:
If what BornAgain sais doesnt
Mon, 10/19/2015 - 22:46

If what BornAgain sais doesnt work can you pleasesendo send the gradle console error?It would help solve the problem

Last seen on 02:52, 31. May 2017
Joined Aug 2015
User points:

Statistics:

  • Comments:
  • Forum topics:
  • Modifications:
  • Wiki pages:
RE:If what BornAgain sais doesnt
Tue, 10/20/2015 - 00:54

@#2 

C:\Users\me_000\Desktop\MCreator 1.5.8 [1.8] (1)\forge\build\sources\java\mod\mcreator\mcreator_banana.java:119: error: no suitable method found for onBlockDestroyed(ItemStack,World,int,int,int,int,EntityLivingBase)
super.onBlockDestroyed(itemstack, world, i, j, k, l, entity);
     ^
    method ItemTool.onBlockDestroyed(ItemStack,World,Block,BlockPos,EntityLivingBase) is not applicable
      (actual and formal argument lists differ in length)
    method Item.onBlockDestroyed(ItemStack,World,Block,BlockPos,EntityLivingBase) is not applicable
      (actual and formal argument lists differ in length)
1 error

FAILURE: Build failed with an exception.

* What went wrong:
Execution failed for task ':compileJava'.
> Compilation failed; see the compiler error output for details.

* Try:
Run with --stacktrace option to get the stack trace. Run with --info or --debug option to get more log output.

Last seen on 02:47, 1. Aug 2018
Joined Jul 2015
User points:

Statistics:

  • Comments:
  • Forum topics:
  • Modifications:
  • Wiki pages:
Can you post the crash report
Tue, 10/20/2015 - 02:40

Can you post the crash report?

Last seen on 02:52, 31. May 2017
Joined Aug 2015
User points:

Statistics:

  • Comments:
  • Forum topics:
  • Modifications:
  • Wiki pages:
RE:RE:If what BornAgain sais doesnt
Tue, 10/20/2015 - 22:46

@#2.1 I did

Last seen on 02:52, 31. May 2017
Joined Aug 2015
User points:

Statistics:

  • Comments:
  • Forum topics:
  • Modifications:
  • Wiki pages:
RE:Can you post the crash report
Thu, 10/22/2015 - 03:02

@#3 

C:\Users\me_000\Desktop\MCreator 1.5.8 [1.8] (1)\forge\build\sources\java\mod\mcreator\mcreator_banana.java:119: error: no suitable method found for onBlockDestroyed(ItemStack,World,int,int,int,int,EntityLivingBase)
super.onBlockDestroyed(itemstack, world, i, j, k, l, entity);
     ^
    method ItemTool.onBlockDestroyed(ItemStack,World,Block,BlockPos,EntityLivingBase) is not applicable
      (actual and formal argument lists differ in length)
    method Item.onBlockDestroyed(ItemStack,World,Block,BlockPos,EntityLivingBase) is not applicable
      (actual and formal argument lists differ in length)
1 error

FAILURE: Build failed with an exception.

* What went wrong:
Execution failed for task ':compileJava'.
> Compilation failed; see the compiler error output for details.

* Try:
Run with --stacktrace option to get the stack trace. Run with --info or --debug option to get more log output.