I can't start survival/creative to test my mod.

Started by KillaD1 on Sun, 11/01/2015 - 17:56
Last seen on 21:35, 22. Nov 2015
Joined Nov 2015
User points:

Statistics:

  • Comments:
  • Forum topics:
  • Modifications:
  • Wiki pages:
I can't start survival/creative to test my mod.
Sun, 11/01/2015 - 17:56

Hi, KillaD1 here. I'm trying to do a test run to see what my mod textures look in game, but it won't let me. This is what comes up for me.

 

[Spoiler]

>:downloadClient
>FAILURE: Build failed with an exception.
>* What went wrong:
>java.io.FileNotFoundException: C:\Users\Name\Desktop\forge\.gradle\2.0\taskArtifacts\cache.properties (The system cannot find the file specified)
>> C:\Users\Name\Desktop\forge\.gradle\2.0\taskArtifacts\cache.properties (The system cannot find the file specified)
>* Try:
>Run with --stacktrace option to get the stack trace. Run with --info or --debug option to get more log output.
>BUILD FAILED
>Total time: 11.121 secs
>C:\Users\Name\Desktop\forge>
>Task completed with return code 0 in 11912 milliseconds
>Task return code check OK!

 

 

Last seen on 21:35, 22. Nov 2015
Joined Nov 2015
User points:

Statistics:

  • Comments:
  • Forum topics:
  • Modifications:
  • Wiki pages:
Oh, I thought spoiler's work.
Sun, 11/01/2015 - 17:57

Oh, I thought spoiler's work.

 

Last seen on 08:18, 12. Jan 2018
Joined May 2015
User points:

Statistics:

  • Comments:
  • Forum topics:
  • Modifications:
  • Wiki pages:
what was the latest thing you
Sun, 11/01/2015 - 18:04

what was the latest thing you had made?