ERROR!!!

Started by Winter_Persone on Sun, 11/15/2015 - 14:45
Last seen on 17:37, 15. Jan 2016
Joined Nov 2015
User points:

Statistics:

  • Comments:
  • Forum topics:
  • Modifications:
  • Wiki pages:
ERROR!!!
Sun, 11/15/2015 - 14:45

Help! When you compile the mod, this error comes out! What to do?
Executing gradle command: clean build
Microsoft Windows [Version 6.1.7601]
(c) Љ®аЇ®а жЁп Њ ©Єа®б®дв (Microsoft Corp.), 2009. ‚ᥠЇа ў  § йЁйҐ­л.
C:\Pylo\MCreator160>cd forge
C:\Pylo\MCreator160\forge>SET "JAVA_HOME=C:\Pylo\MCreator160\jdk\"
C:\Pylo\MCreator160\forge>SET JAVA_EXE=%JAVA_HOME%\bin\java.exe
C:\Pylo\MCreator160\forge>SET PATH=%JAVA_HOME%\bin\;%PATH%
C:\Pylo\MCreator160\forge>SET "JAVA_OPTS=-Xmx256m -Xms200m"
C:\Pylo\MCreator160\forge>gradlew clean build
****************************
 Powered By MCP:             
 http://modcoderpack.com/    
 Searge, ProfMobius, Fesh0r, 
 R4wk, ZeuX, IngisKahn, bspkrs
 MCP Data version : snapshot_20141130
****************************
:clean
:compileApiJava UP-TO-DATE
:processApiResources UP-TO-DATE
:apiClasses UP-TO-DATE
:sourceMainJava
:compileJava
:processResources
:classes
:jar
:compileTestJava UP-TO-DATE
:processTestResources UP-TO-DATE
:testClasses UP-TO-DATE
:test UP-TO-DATE
:extractMcpData UP-TO-DATE
:getVersionJson
:extractUserDev UP-TO-DATE
:genSrgs SKIPPED
:reobf FAILED
FAILURE: Build failed with an exception.
* What went wrong:
Execution failed for task ':reobf'.
> MALFORMED
* Try:
Run with --stacktrace option to get the stack trace. Run with --info or --debug option to get more log output.
BUILD FAILED
Total time: 25.518 secs
C:\Pylo\MCreator160\forge>
Task completed with return code 0 in 26440 milliseconds
Task return code check OK!