Error when trying start minecraft

Started by WebmailCZ on Sun, 11/29/2015 - 14:18
Last seen on 14:56, 12. Feb 2016
Joined Jul 2015
User points:

Statistics:

  • Comments:
  • Forum topics:
  • Modifications:
  • Wiki pages:
Error when trying start minecraft
Sun, 11/29/2015 - 14:18

Please help when i tryed to start minecraft console write this error :(
-------------------------
BOOTING UP GRADLE...
Data loaded, MCreator gradle console ready [ver 1.007]! [boot took 9 milliseconds]
RIGHT click once to copy log to the clipboard or twice to clear the log.
   
Executing gradle command: clean runClient
Microsoft Windows [Version 10.0.10240]
(c) 2015 Microsoft Corporation. Vçechna pr va vyhrazena.
C:\Pylo\MCreator160>cd forge
C:\Pylo\MCreator160\forge>SET "JAVA_HOME=C:\Pylo\MCreator160\jdk\"
C:\Pylo\MCreator160\forge>SET JAVA_EXE=%JAVA_HOME%\bin\java.exe
C:\Pylo\MCreator160\forge>SET PATH=%JAVA_HOME%\bin\;%PATH%
C:\Pylo\MCreator160\forge>SET "JAVA_OPTS=-Xmx582m -Xms200m"
C:\Pylo\MCreator160\forge>gradlew clean runClient
****************************
 Powered By MCP:             
 http://modcoderpack.com/    
 Searge, ProfMobius, Fesh0r, 
 R4wk, ZeuX, IngisKahn, bspkrs
 MCP Data version : snapshot_20141130
****************************
:clean
:downloadClient SKIPPED
:downloadServer SKIPPED
:getVersionJson
:extractUserDev UP-TO-DATE
:mergeJars SKIPPED
:applyBinPatches SKIPPED
:downloadMcpTools SKIPPED
:extractMcpData UP-TO-DATE
:genSrgs SKIPPED
:deobfBinJar SKIPPED
:compileApiJava UP-TO-DATE
:processApiResources UP-TO-DATE
:apiClasses UP-TO-DATE
:sourceMainJava
C:\Pylo\MCreator160\forge\build\sources\java\mod\mcreator\TestEnvironmentMod.java:106: error: cannot find symbol
mcreator_moreFood mcreator_2 = new mcreator_moreFood();
^
  symbol:   class mcreator_moreFood
  location: class TestEnvironmentMod
C:\Pylo\MCreator160\forge\build\sources\java\mod\mcreator\TestEnvironmentMod.java:106: error: cannot find symbol
mcreator_moreFood mcreator_2 = new mcreator_moreFood();
                                   ^
  symbol:   class mcreator_moreFood
  location: class TestEnvironmentMod
C:\Pylo\MCreator160\forge\build\sources\java\mod\mcreator\mcreator_flour.java:131: error: cannot find symbol
setCreativeTab(mcreator_moreFood.tab);
               ^
  symbol:   variable mcreator_moreFood
  location: class Itemflour
C:\Pylo\MCreator160\forge\build\sources\java\mod\mcreator\mcreator_butter.java:131: error: cannot find symbol
setCreativeTab(mcreator_moreFood.tab);
               ^
  symbol:   variable mcreator_moreFood
  location: class Itembutter
C:\Pylo\MCreator160\forge\build\sources\java\mod\mcreator\mcreator_salt.java:128: error: cannot find symbol
setCreativeTab(mcreator_moreFood.tab);
               ^
  symbol:   variable mcreator_moreFood
  location: class Itemsalt
5 errors
:compileJava FAILED
FAILURE: Build failed with an exception.
* What went wrong:
Execution failed for task ':compileJava'.
> Compilation failed; see the compiler error output for details.
* Try:
BUILD FAILED
Run with --stacktrace option to get the stack trace. Run with --info or --debug option to get more log output.
Total time: 1 mins 42.72 secs
C:\Pylo\MCreator160\forge>
Task completed with return code 0 in 103314 milliseconds

 

Last seen on 08:18, 12. Jan 2018
Joined May 2015
User points:

Statistics:

  • Comments:
  • Forum topics:
  • Modifications:
  • Wiki pages:
I believe there is something
Sun, 11/29/2015 - 15:46

I believe there is something wrong with flour, Butter, and salt you had add something that makes an error look around at those three items and try to see hows causing the error