Help me i have errors preventing me from exporting mods

Started by WampaStompa on Sun, 12/06/2015 - 19:52
Last seen on 20:11, 11. Dec 2015
Joined Dec 2015
User points:

Statistics:

  • Comments:
  • Forum topics:
  • Modifications:
  • Wiki pages:
Help me i have errors preventing me from exporting mods
Sun, 12/06/2015 - 19:52

when ever i try to test or export my mod it comes up with this error meassge can someone tell me how to fix and what to do thank you

 

:clean
:downloadClient SKIPPED
:downloadServer SKIPPED
:getVersionJson
:extractUserDev
FAILURE: Build failed with an exception.
* What went wrong:
java.io.FileNotFoundException: C:\Users\Robert\Desktop\Mcreator\forge\.gradle\2.0\taskArtifacts\cache.properties (The system cannot find the file specified)
> C:\Users\Robert\Desktop\Mcreator\forge\.gradle\2.0\taskArtifacts\cache.properties (The system cannot find the file specified)
* Try:
Run with --stacktrace option to get the stack trace. Run with --info or --debug option to get more log output.
BUILD FAILED
Total time: 26.84 secs
C:\Users\Robert\Desktop\Mcreator\forge>
Task completed with return code 0 in 29887 milliseconds
Task return code check OK!

Last seen on 21:32, 14. Apr 2018
Joined Aug 2015
User points:

Statistics:

  • Comments:
  • Forum topics:
  • Modifications:
  • Wiki pages:
Go to forge, gradle, 2.0
Sun, 12/06/2015 - 20:40

Go to forge, gradle, 2.0 and create a folder named taskArt