help me cant figure out whats wrong with the game it wont let me export mods

Started by WampaStompa on Sun, 12/06/2015 - 22:06
Last seen on 20:11, 11. Dec 2015
Joined Dec 2015
User points:

Statistics:

  • Comments:
  • Forum topics:
  • Modifications:
  • Wiki pages:
help me cant figure out whats wrong with the game it wont let me export mods
Sun, 12/06/2015 - 22:06

this is the error messages from trying to export mods

i keep geting and it wont go away ive tryed everything anny help  is much needed

BOOTING UP GRADLE...
Data loaded, MCreator gradle console ready [ver 1.007]! [boot took 8 milliseconds]
RIGHT click once to copy log to the clipboard or twice to clear the log.
   
Executing gradle command: clean runClient
Microsoft Windows [Version 10.0.10240]
(c) 2015 Microsoft Corporation. All rights reserved.
C:\Users\Robert\Desktop\Mcreator>cd forge
C:\Users\Robert\Desktop\Mcreator\forge>SET "JAVA_HOME=C:\Users\Robert\Desktop\Mcreator\jdk\"
C:\Users\Robert\Desktop\Mcreator\forge>SET JAVA_EXE=%JAVA_HOME%\bin\java.exe
C:\Users\Robert\Desktop\Mcreator\forge>SET PATH=%JAVA_HOME%\bin\;%PATH%
C:\Users\Robert\Desktop\Mcreator\forge>SET "JAVA_OPTS=-Xmx256m -Xms200m"
C:\Users\Robert\Desktop\Mcreator\forge>gradlew clean runClient
****************************
 Powered By MCP:             
 http://modcoderpack.com/    
 Searge, ProfMobius, Fesh0r,
 R4wk, ZeuX, IngisKahn, bspkrs
 MCP Data version : snapshot_20141130
****************************
:clean
:downloadClient SKIPPED
:downloadServer SKIPPED
:getVersionJson
:extractUserDev
FAILURE: Build failed with an exception.
* What went wrong:
java.io.FileNotFoundException: C:\Users\Robert\Desktop\Mcreator\forge\.gradle\2.0\taskArtifacts\cache.properties (The system cannot find the file specified)
> C:\Users\Robert\Desktop\Mcreator\forge\.gradle\2.0\taskArtifacts\cache.properties (The system cannot find the file specified)
* Try:
Run with --stacktrace option to get the stack trace. Run with --info or --debug option to get more log output.
BUILD FAILED
Total time: 15.046 secs
C:\Users\Robert\Desktop\Mcreator\forge>
Task completed with return code 0 in 15751 milliseconds
Task return code check OK!

 

 

Last seen on 22:40, 16. Apr 2016
Joined Nov 2015
User points:

Statistics:

  • Comments:
  • Forum topics:
  • Modifications:
  • Wiki pages:
Maybe It Wont Export Cuz It
Sun, 12/06/2015 - 23:42

Maybe It Wont Export Cuz It Saying FAILURE: Build failed with an exception. (Say This ™)

 

Last seen on 08:18, 12. Jan 2018
Joined May 2015
User points:

Statistics:

  • Comments:
  • Forum topics:
  • Modifications:
  • Wiki pages:
i believe you have some files
Mon, 12/07/2015 - 00:15

i believe you have some files missing