Error in Recompile

Started by Erik444 on Sun, 12/27/2015 - 14:20
Last seen on 04:26, 5. Aug 2018
Joined May 2015
User points:

Statistics:

  • Comments:
  • Forum topics:
  • Modifications:
  • Wiki pages:
Error in Recompile
Sun, 12/27/2015 - 14:20 (edited)

this is my problem D: pls heeeelpp

D:\Pylo\MCreator160>cd forge
D:\Pylo\MCreator160\forge>SET "JAVA_HOME=D:\Pylo\MCreator160\jdk\"
D:\Pylo\MCreator160\forge>SET JAVA_EXE=%JAVA_HOME%\bin\java.exe
D:\Pylo\MCreator160\forge>SET PATH=%JAVA_HOME%\bin\;%PATH%
D:\Pylo\MCreator160\forge>SET "JAVA_OPTS=-Xmx870m -Xms128m"
D:\Pylo\MCreator160\forge>gradlew clean build
Downloading https://services.gradle.org/distributions/gradle-2.0-bin.zip
.........................................................................................................................................................................................................................................................................................................................................................................................................................................................................................................................................................................................................................................................................................................................................................................................................................................................................................................................................................................................................................................................................................................................................................................................................................................................................................................................................................................................................................................................................................................................................................................................................................................................................................................................................................................................................................................................................................................................................................................................................................................................................................................................................................
Unzipping C:\Documents and Settings\Erik-Pc\Escritorio\.gradle\wrapper\dists\gradle-2.0-bin\5h57m9vra0mjv9qs45oqtsb5c0\gradle-2.0-bin.zip to C:\Documents and Settings\Erik-Pc\Escritorio\.gradle\wrapper\dists\gradle-2.0-bin\5h57m9vra0mjv9qs45oqtsb5c0
BUILD FAILED
Total time: 4 mins 50.734 secs
D:\Pylo\MCreator160\forge>
FAILURE: Build failed with an exception.
* Where:
Build file 'D:\Pylo\MCreator160\forge\build.gradle' line: 13
* What went wrong:
A problem occurred evaluating root project 'forge'.
> build_1tqiqf8cvb8n3nt587c4mtultk$_run_closure1_closure3
* Try:
Run with --stacktrace option to get the stack trace. Run with --info or --debug option to get more log output.
Task completed with return code 0 in 299531 milliseconds
Task return code check OK!

Edited by Erik444 on Sun, 12/27/2015 - 14:20
Last seen on 04:26, 5. Aug 2018
Joined May 2015
User points:

Statistics:

  • Comments:
  • Forum topics:
  • Modifications:
  • Wiki pages:
im delete all mods, and now
Sun, 12/27/2015 - 14:30

im delete all mods, and now

Executing gradle command: clean build
Microsoft Windows XP [Versi¢n 5.1.2600]
(C) Copyright 1985-2001 Microsoft Corp.
D:\Pylo\MCreator160>cd forge
D:\Pylo\MCreator160\forge>SET "JAVA_HOME=D:\Pylo\MCreator160\jdk\"
D:\Pylo\MCreator160\forge>SET JAVA_EXE=%JAVA_HOME%\bin\java.exe
D:\Pylo\MCreator160\forge>SET PATH=%JAVA_HOME%\bin\;%PATH%
D:\Pylo\MCreator160\forge>SET "JAVA_OPTS=-Xmx870m -Xms128m"
D:\Pylo\MCreator160\forge>gradlew clean build
Download http://files.minecraftforge.net/maven/net/minecraftforge/gradle/ForgeGr…
FAILURE: Build failed with an exception.
* What went wrong:
A problem occurred configuring root project 'forge'.
> Could not resolve all dependencies for configuration ':classpath'.
   > Could not resolve net.minecraftforge.gradle:ForgeGradle:1.2-SNAPSHOT.
     Required by:
         :forge:unspecified
      > Could not parse POM http://files.minecraftforge.net/maven/net/minecraftforge/gradle/ForgeGr…
         > C:\Documents and Settings\Erik-Pc\Escritorio\.gradle\caches\modules-2\files-2.1\net.minecraftforge.gradle\ForgeGradle\1.2-SNAPSHOT\c4f03c8c1e3373541f18263477961ef8e2a1458f\ForgeGradle-1.2-SNAPSHOT.pom (El proceso no tiene acceso al archivo porque está siendo utilizado por otro proceso)
* Try:
Run with --stacktrace option to get the stack trace. Run with --info or --debug option to get more log output.
BUILD FAILED
Total time: 28.453 secs
D:\Pylo\MCreator160\forge>
Task completed with return code 0 in 30610 milliseconds
Task return code check OK!