ERROR Exporting & Testing MOD

Started by blazerzzcraft on Fri, 01/08/2016 - 11:04
Last seen on 19:42, 9. Jan 2016
Joined Jan 2016
User points:

Statistics:

  • Comments:
  • Forum topics:
  • Modifications:
  • Wiki pages:
ERROR Exporting & Testing MOD
Fri, 01/08/2016 - 11:04

Hi, I am experiencing the following ERROR msg - anyone has a clue how to solve it:

----

FAILURE: Build failed with an exception.
* What went wrong:
java.io.FileNotFoundException: C:\Pylo\MCreator160\forge\.gradle\2.0\taskArtifacts\cache.properties (O sistema não pode encontrar o arquivo especificado)
> C:\Pylo\MCreator160\forge\.gradle\2.0\taskArtifacts\cache.properties (O sistema não pode encontrar o arquivo especificado)
BUILD FAILED
* Try:
Total time: 20.851 secs
Run with --stacktrace option to get the stack trace. Run with --info or --debug option to get more log output.

----

many Thanks