help

Started by keithamillio on Sun, 01/10/2016 - 11:04
Last seen on 23:09, 10. Jan 2016
Joined Jan 2016
User points:

Statistics:

  • Comments:
  • Forum topics:
  • Modifications:
  • Wiki pages:
help
Sun, 01/10/2016 - 11:04

FAILURE: Build failed with an exception.
* What went wrong:
java.io.FileNotFoundException: C:\Pylo\MCreator160\forge\.gradle\2.0\taskArtifacts\cache.properties (The system cannot find the file specified)
> C:\Pylo\MCreator160\forge\.gradle\2.0\taskArtifacts\cache.properties (The system cannot find the file specified)
* Try:
Run with --stacktrace option to get the stack trace. Run with --info or --debug option to get more log output.
BUILD FAILED