i keep getting this error...

Started by Legenday_zotar on Mon, 01/18/2016 - 16:56
Last seen on 18:36, 12. Mar 2017
Joined Jan 2016
User points:

Statistics:

  • Comments:
  • Forum topics:
  • Modifications:
  • Wiki pages:
i keep getting this error...
Mon, 01/18/2016 - 16:56

well i keep getting the same error i deleted my mods and when i made them again it happened again any help? 

heres the log

 

 

 

 

​BOOTING UP GRADLE...

Data loaded, MCreator gradle console ready [ver 1.007]! [boot took 0 milliseconds]
RIGHT click once to copy log to the clipboard or twice to clear the log.
   
Executing gradle command: clean runClient
Microsoft Windows [Version 6.3.9600]
(c) 2013 Microsoft Corporation. All rights reserved.
C:\Pylo\MCreator160>cd forge
C:\Pylo\MCreator160\forge>SET "JAVA_HOME=C:\Pylo\MCreator160\jdk\"
C:\Pylo\MCreator160\forge>SET JAVA_EXE=%JAVA_HOME%\bin\java.exe
C:\Pylo\MCreator160\forge>SET PATH=%JAVA_HOME%\bin\;%PATH%
C:\Pylo\MCreator160\forge>SET "JAVA_OPTS=-Xmx256m -Xms200m"
C:\Pylo\MCreator160\forge>gradlew clean runClient
****************************
 Powered By MCP:             
 http://modcoderpack.com/    
 Searge, ProfMobius, Fesh0r, 
 R4wk, ZeuX, IngisKahn, bspkrs
 MCP Data version : snapshot_20141130
****************************
:clean
:downloadClient SKIPPED
:downloadServer SKIPPED
:getVersionJson
:extractUserDev UP-TO-DATE
:mergeJars SKIPPED
:applyBinPatches SKIPPED
:downloadMcpTools SKIPPED
:extractMcpData UP-TO-DATE
:genSrgs SKIPPED
:deobfBinJar SKIPPED
:compileApiJava UP-TO-DATE
:processApiResources UP-TO-DATE
:apiClasses UP-TO-DATE
:sourceMainJava
C:\Pylo\MCreator160\forge\build\sources\java\mod\mcreator\TestEnvironmentMod.java:104: error: cannot find symbol
    mcreator_sapphire mcreator_0 = new mcreator_sapphire();
    ^
  symbol:   class mcreator_sapphire
  location: class TestEnvironmentMod
C:\Pylo\MCreator160\forge\build\sources\java\mod\mcreator\TestEnvironmentMod.java:105: error: cannot find symbol
mcreator_sapphireOre mcreator_1 = new mcreator_sapphireOre();
^
  symbol:   class mcreator_sapphireOre
  location: class TestEnvironmentMod
C:\Pylo\MCreator160\forge\build\sources\java\mod\mcreator\TestEnvironmentMod.java:106: error: cannot find symbol
mcreator_sapphirePickaxe mcreator_2 = new mcreator_sapphirePickaxe();
^
  symbol:   class mcreator_sapphirePickaxe
  location: class TestEnvironmentMod
C:\Pylo\MCreator160\forge\build\sources\java\mod\mcreator\TestEnvironmentMod.java:107: error: cannot find symbol
mcreator_sapphireAxe mcreator_3 = new mcreator_sapphireAxe();
^
  symbol:   class mcreator_sapphireAxe
  location: class TestEnvironmentMod
C:\Pylo\MCreator160\forge\build\sources\java\mod\mcreator\TestEnvironmentMod.java:108: error: cannot find symbol
mcreator_sapphireShovel mcreator_4 = new mcreator_sapphireShovel();
^
  symbol:   class mcreator_sapphireShovel
  location: class TestEnvironmentMod
C:\Pylo\MCreator160\forge\build\sources\java\mod\mcreator\TestEnvironmentMod.java:109: error: cannot find symbol
mcreator_sapphireHoe mcreator_5 = new mcreator_sapphireHoe();
^
  symbol:   class mcreator_sapphireHoe
  location: class TestEnvironmentMod
C:\Pylo\MCreator160\forge\build\sources\java\mod\mcreator\TestEnvironmentMod.java:111: error: cannot find symbol
mcreator_sapphireArmour mcreator_7 = new mcreator_sapphireArmour();
^
  symbol:   class mcreator_sapphireArmour
  location: class TestEnvironmentMod
C:\Pylo\MCreator160\forge\build\sources\java\mod\mcreator\TestEnvironmentMod.java:112: error: cannot find symbol
mcreator_sapphireBlock mcreator_8 = new mcreator_sapphireBlock();
^
  symbol:   class mcreator_sapphireBlock
  location: class TestEnvironmentMod
C:\Pylo\MCreator160\forge\build\sources\java\mod\mcreator\TestEnvironmentMod.java:113: error: cannot find symbol
mcreator_emeraldPickaxe mcreator_9 = new mcreator_emeraldPickaxe();
^
  symbol:   class mcreator_emeraldPickaxe
  location: class TestEnvironmentMod
C:\Pylo\MCreator160\forge\build\sources\java\mod\mcreator\TestEnvironmentMod.java:117: error: cannot find symbol
mcreator_emeraldHoe mcreator_13 = new mcreator_emeraldHoe();
^
  symbol:   class mcreator_emeraldHoe
  location: class TestEnvironmentMod
C:\Pylo\MCreator160\forge\build\sources\java\mod\mcreator\TestEnvironmentMod.java:104: error: cannot find symbol
    mcreator_sapphire mcreator_0 = new mcreator_sapphire();
                                       ^
  symbol:   class mcreator_sapphire
  location: class TestEnvironmentMod
C:\Pylo\MCreator160\forge\build\sources\java\mod\mcreator\TestEnvironmentMod.java:105: error: cannot find symbol
mcreator_sapphireOre mcreator_1 = new mcreator_sapphireOre();
                                      ^
  symbol:   class mcreator_sapphireOre
  location: class TestEnvironmentMod
C:\Pylo\MCreator160\forge\build\sources\java\mod\mcreator\TestEnvironmentMod.java:106: error: cannot find symbol
mcreator_sapphirePickaxe mcreator_2 = new mcreator_sapphirePickaxe();
                                          ^
  symbol:   class mcreator_sapphirePickaxe
  location: class TestEnvironmentMod
C:\Pylo\MCreator160\forge\build\sources\java\mod\mcreator\TestEnvironmentMod.java:107: error: cannot find symbol
mcreator_sapphireAxe mcreator_3 = new mcreator_sapphireAxe();
                                      ^
  symbol:   class mcreator_sapphireAxe
  location: class TestEnvironmentMod
C:\Pylo\MCreator160\forge\build\sources\java\mod\mcreator\TestEnvironmentMod.java:108: error: cannot find symbol
mcreator_sapphireShovel mcreator_4 = new mcreator_sapphireShovel();
                                         ^
  symbol:   class mcreator_sapphireShovel
  location: class TestEnvironmentMod
C:\Pylo\MCreator160\forge\build\sources\java\mod\mcreator\TestEnvironmentMod.java:109: error: cannot find symbol
mcreator_sapphireHoe mcreator_5 = new mcreator_sapphireHoe();
                                      ^
  symbol:   class mcreator_sapphireHoe
  location: class TestEnvironmentMod
C:\Pylo\MCreator160\forge\build\sources\java\mod\mcreator\TestEnvironmentMod.java:111: error: cannot find symbol
mcreator_sapphireArmour mcreator_7 = new mcreator_sapphireArmour();
                                         ^
  symbol:   class mcreator_sapphireArmour
  location: class TestEnvironmentMod
C:\Pylo\MCreator160\forge\build\sources\java\mod\mcreator\TestEnvironmentMod.java:112: error: cannot find symbol
mcreator_sapphireBlock mcreator_8 = new mcreator_sapphireBlock();
                                        ^
  symbol:   class mcreator_sapphireBlock
  location: class TestEnvironmentMod
C:\Pylo\MCreator160\forge\build\sources\java\mod\mcreator\TestEnvironmentMod.java:113: error: cannot find symbol
mcreator_emeraldPickaxe mcreator_9 = new mcreator_emeraldPickaxe();
                                         ^
  symbol:   class mcreator_emeraldPickaxe
  location: class TestEnvironmentMod
C:\Pylo\MCreator160\forge\build\sources\java\mod\mcreator\TestEnvironmentMod.java:117: error: cannot find symbol
mcreator_emeraldHoe mcreator_13 = new mcreator_emeraldHoe();
                                      ^
  symbol:   class mcreator_emeraldHoe
  location: class TestEnvironmentMod
C:\Pylo\MCreator160\forge\build\sources\java\mod\mcreator\mcreator_sapphireSword.java:103: error: cannot find symbol
    "X1X", "X4X", "X7X", Character.valueOf('1'), new ItemStack(mcreator_sapphire.block, 1), Character.valueOf('4'), new ItemStack(mcreator_sapphire.block, 1), Character.valueOf('7'), new ItemStack(Items.stick, 1), 
                                                               ^
  symbol:   variable mcreator_sapphire
  location: class mcreator_sapphireSword
C:\Pylo\MCreator160\forge\build\sources\java\mod\mcreator\mcreator_sapphireSword.java:103: error: cannot find symbol
    "X1X", "X4X", "X7X", Character.valueOf('1'), new ItemStack(mcreator_sapphire.block, 1), Character.valueOf('4'), new ItemStack(mcreator_sapphire.block, 1), Character.valueOf('7'), new ItemStack(Items.stick, 1), 
                                                                                                                                  ^
  symbol:   variable mcreator_sapphire
  location: class mcreator_sapphireSword
22 errors
:compileJava FAILED
FAILURE: Build failed with an exception.
* What went wrong:
Execution failed for task ':compileJava'.
> Compilation failed; see the compiler error output for details.
* Try:
BUILD FAILED
Run with --stacktrace option to get the stack trace. Run with --info or --debug option to get more log output.
Total time: 27.885 secs
C:\Pylo\MCreator160\forge>
Task completed with return code 0 in 29197 milliseconds

 

 

 

thanks hope you can help and if you could show me how to change the name from TestEnvironmentMod that will help too :)