What is going on

Started by BobStevens on Tue, 01/19/2016 - 20:13
Last seen on 23:15, 22. Jan 2016
Joined Jan 2016
User points:

Statistics:

  • Comments:
  • Forum topics:
  • Modifications:
  • Wiki pages:
What is going on
Tue, 01/19/2016 - 20:13

Everytime I try loading up the test thing it says this:

:clean UP-TO-DATE
:deobfCompileDummyTask
:deobfProvidedDummyTask
FAILURE: Build failed with an exception.
* What went wrong:
java.io.FileNotFoundException: C:\Users\Colin\Desktop\MCreator\forge\.gradle\2.7\taskArtifacts\cache.properties (The system cannot find the file specified)
> C:\Users\Colin\Desktop\MCreator\forge\.gradle\2.7\taskArtifacts\cache.properties (The system cannot find the file specified)
* Try:
Run with --stacktrace option to get the stack trace. Run with --info or --debug option to get more log output.
:getVersionJson
BUILD FAILED
Total time: 7.22 secs
C:\Users\Colin\Desktop\MCreator\forge>
Task completed with return code 0 in 8696 milliseconds

 

I dont know what that is, and if I try to export a mod, it says: Your mod contains errors and could not be exported No mod file was generated.

 

Please reply with a fix and not " UGH I DONT KNOW WHAT IS GOING ON EITHER, UGHGHUGHUG"

Last seen on 23:15, 22. Jan 2016
Joined Jan 2016
User points:

Statistics:

  • Comments:
  • Forum topics:
  • Modifications:
  • Wiki pages:
UGH I DONT KNOW WHAT IS GOING
Tue, 01/19/2016 - 20:14

UGH I DONT KNOW WHAT IS GOING ON EITHER, UGHGHUGHUG

 

 

 

Last seen on 08:18, 12. Jan 2018
Joined May 2015
User points:

Statistics:

  • Comments:
  • Forum topics:
  • Modifications:
  • Wiki pages:
follow the folder locations
Tue, 01/19/2016 - 21:51

follow the folder locations and see if you have cache.properties