Compilation error whenever a .schematic is used.

Started by SteamMau5 on Sat, 01/30/2016 - 16:15
Last seen on 02:53, 6. Apr 2018
Joined Jan 2016
User points:

Statistics:

  • Comments:
  • Forum topics:
  • Modifications:
  • Wiki pages:
Compilation error whenever a .schematic is used.
Sat, 01/30/2016 - 16:15

Whenever I attempt to use a .schematic file in a new SchematicGen, or Dimension, I get a compilation error. It's the same thing every time...

#################################################
:clean
:deobfCompileDummyTask
:deobfProvidedDummyTask
:sourceApiJava
:compileApiJava UP-TO-DATE
:processApiResources UP-TO-DATE
:apiClasses UP-TO-DATE
:sourceMainJava
C:\Pylo\MCreator162\forge\build\sources\main\java\mod\mcreator\mcreator_openCavernDimension.java:1157: error: method getHeight in class Chunk cannot be applied to given types;
int j = world.getChunkFromChunkCoords(i, k).getHeight(i & 15, k & 15)-1;
                                           ^
  required: BlockPos
  found: int,int
  reason: actual and formal argument lists differ in length
1 error
:compileJava FAILED
FAILURE: Build failed with an exception.
* What went wrong:
Execution failed for task ':compileJava'.
BUILD FAILED
> Compilation failed; see the compiler error output for details.
Total time: 6.445 secs
* Try:
Run with --stacktrace option to get the stack trace. Run with --info or --debug option to get more log output.
C:\Pylo\MCreator162\forge>
Task completed with return code 0 in 6861 milliseconds