>Executing gradle command: runClient FAILURE: Build failed with an exception.

Started by hhamza1 on Sat, 02/06/2016 - 21:59
Last seen on 12:35, 12. Feb 2016
Joined Feb 2016
User points:

Statistics:

  • Comments:
  • Forum topics:
  • Modifications:
  • Wiki pages:
>Executing gradle command: runClient FAILURE: Build failed with an exception.
Sat, 02/06/2016 - 22:31 (edited)

Please, when I create a mod , I have this :>Executing gradle command: runClient
>Microsoft Windows [version 6.1.7601]
>Copyright (c) 2009 Microsoft Corporation. Tous droits r‚serv‚s.
>D:\Pylo\MCreator159>cd forge
>D:\Pylo\MCreator159\forge>SET "JAVA_HOME=D:\Pylo\MCreator159\jdk\"
>D:\Pylo\MCreator159\forge>SET JAVA_EXE=%JAVA_HOME%\bin\java.exe
>D:\Pylo\MCreator159\forge>SET PATH=%JAVA_HOME%\bin\;%PATH%
>D:\Pylo\MCreator159\forge>gradlew runClient
>FAILURE: Build failed with an exception.
>* Where:
>Build file 'D:\Pylo\MCreator159\forge\build.gradle' line: 18
>* What went wrong:
>A problem occurred evaluating root project 'forge'.
>> com.google.gson.stream.MalformedJsonException: Unterminated string at line 23100 column 14
>* Try:
>Run with --stacktrace option to get the stack trace. Run with --info or --debug option to get more log output.
>BUILD FAILED
>Total time: 30.413 secs
>D:\Pylo\MCreator159\forge>
>Task completed with return code 0 in 33464 milliseconds
>Task return code check OK!

 

 

 

 

 

>Executing gradle command: build
>MCreator was not able to connect to the internet. Gradle tasks are not going to work.
>Microsoft Windows [version 6.1.7601]
>Copyright (c) 2009 Microsoft Corporation. Tous droits r‚serv‚s.
>D:\Pylo\MCreator159>cd forge
>D:\Pylo\MCreator159\forge>SET "JAVA_HOME=D:\Pylo\MCreator159\jdk\"
>D:\Pylo\MCreator159\forge>SET JAVA_EXE=%JAVA_HOME%\bin\java.exe
>D:\Pylo\MCreator159\forge>SET PATH=%JAVA_HOME%\bin\;%PATH%
>D:\Pylo\MCreator159\forge>gradlew build
>FAILURE: Build failed with an exception.
>* Where:
>Build file 'D:\Pylo\MCreator159\forge\build.gradle' line: 18
>* What went wrong:
>A problem occurred evaluating root project 'forge'.
>> com.google.gson.stream.MalformedJsonException: Unterminated string at line 23100 column 14
>* Try:
>Run with --stacktrace option to get the stack trace. Run with --info or --debug option to get more log output.
>BUILD FAILED
>Total time: 5.827 secs
>D:\Pylo\MCreator159\forge>
>Task completed with return code 0 in 6349 milliseconds
>Task return code check OK!

 

 

 

 

 

 I need help!!          T.T

 

Edited by hhamza1 on Sat, 02/06/2016 - 22:31