recompiling fail :(

Started by dodison on Sat, 02/27/2016 - 21:25
Last seen on 18:32, 30. May 2017
Joined Jan 2015
User points:

Statistics:

  • Comments:
  • Forum topics:
  • Modifications:
  • Wiki pages:
recompiling fail :(
Sat, 02/27/2016 - 21:25

BOOTING UP GRADLE...
Data loaded, MCreator gradle console ready [ver 1.007]! [boot took 0 milliseconds]
RIGHT click once to copy log to the clipboard or twice to clear the log.
   
Executing gradle command: clean runClient
Microsoft Windows [Version 10.0.10240]
(c) 2015 Microsoft Corporation. Wszelkie prawa zastrzeľone.
C:\Pylo\MCreator165>cd forge
C:\Pylo\MCreator165\forge>SET "JAVA_HOME=C:\Pylo\MCreator165\jdk64\"
C:\Pylo\MCreator165\forge>SET JAVA_EXE=%JAVA_HOME%\bin\java.exe
C:\Pylo\MCreator165\forge>SET PATH=%JAVA_HOME%\bin\;%PATH%
C:\Pylo\MCreator165\forge>SET "JAVA_OPTS=-Xmx2048m -Xms625m"
C:\Pylo\MCreator165\forge>gradlew clean runClient
This set of MCP mappings was designed for MC 1.8.8. Use at your own peril.
#################################################
         ForgeGradle 2.1-SNAPSHOT-75bb646        
  https://github.com/MinecraftForge/ForgeGradle  
#################################################
               Powered by MCP unknown               
             http://modcoderpack.com             
         by: Searge, ProfMobius, Fesh0r,         
         R4wk, ZeuX, IngisKahn, bspkrs           
#################################################
:clean UP-TO-DATE
:deobfCompileDummyTask
:deobfProvidedDummyTask
:getVersionJson
:extractUserdev UP-TO-DATE
:downloadClient SKIPPED
:downloadServer
:splitServerJar
:mergeJars
:applyBinaryPatches
:extractDependencyATs SKIPPED
:extractMcpData SKIPPED
:extractMcpMappings
:genSrgs SKIPPED
:deobfMcMCP
Applying SpecialSource...
Applying Exceptor...
:sourceApiJava
:compileApiJava UP-TO-DATE
:processApiResources UP-TO-DATE
:apiClasses UP-TO-DATE
:sourceMainJava
:compileJava
Download https://libraries.minecraft.net/oshi-project/oshi-core/1.1/oshi-core-1…
Download https://repo1.maven.org/maven2/net/java/dev/jna/jna/3.4.0/jna-3.4.0.pom
Download https://repo1.maven.org/maven2/net/java/dev/jna/platform/3.4.0/platform…
Download https://repo1.maven.org/maven2/io/netty/netty-all/4.0.23.Final/netty-al…
Download https://repo1.maven.org/maven2/io/netty/netty-parent/4.0.23.Final/netty…
Download https://libraries.minecraft.net/com/mojang/authlib/1.5.21/authlib-1.5.2…
Download https://libraries.minecraft.net/com/mojang/realms/1.7.59/realms-1.7.59…
Download https://libraries.minecraft.net/org/lwjgl/lwjgl/lwjgl/2.9.4-nightly-201…
Download https://libraries.minecraft.net/org/lwjgl/lwjgl/parent/2.9.4-nightly-20…
Download https://libraries.minecraft.net/org/lwjgl/lwjgl/lwjgl_util/2.9.4-nightl…
Download https://libraries.minecraft.net/net/minecraft/launchwrapper/1.12/launch…
Download https://repo1.maven.org/maven2/jline/jline/2.13/jline-2.13.pom
Download https://repo1.maven.org/maven2/org/fusesource/jansi/jansi/1.11/jansi-1…
Download https://repo1.maven.org/maven2/org/fusesource/jansi/jansi-project/1.11/…
Download https://repo1.maven.org/maven2/org/fusesource/fusesource-pom/1.8/fuseso…
Download https://libraries.minecraft.net/org/lwjgl/lwjgl/lwjgl-platform/2.9.4-ni…
Download https://libraries.minecraft.net/oshi-project/oshi-core/1.1/oshi-core-1…
Download https://repo1.maven.org/maven2/net/java/dev/jna/jna/3.4.0/jna-3.4.0.jar
Download https://repo1.maven.org/maven2/net/java/dev/jna/platform/3.4.0/platform…
Download https://repo1.maven.org/maven2/io/netty/netty-all/4.0.23.Final/netty-al…
Download https://libraries.minecraft.net/com/mojang/authlib/1.5.21/authlib-1.5.2…
Download https://libraries.minecraft.net/com/mojang/realms/1.7.59/realms-1.7.59…
Download https://libraries.minecraft.net/org/lwjgl/lwjgl/lwjgl/2.9.4-nightly-201…
Download https://libraries.minecraft.net/org/lwjgl/lwjgl/lwjgl_util/2.9.4-nightl…
Download https://libraries.minecraft.net/net/minecraft/launchwrapper/1.12/launch…
Download https://repo1.maven.org/maven2/jline/jline/2.13/jline-2.13.jar
Download https://repo1.maven.org/maven2/org/fusesource/jansi/jansi/1.11/jansi-1…
Download https://libraries.minecraft.net/org/lwjgl/lwjgl/lwjgl-platform/2.9.4-ni…
Download https://libraries.minecraft.net/org/lwjgl/lwjgl/lwjgl-platform/2.9.4-ni…
Download https://libraries.minecraft.net/org/lwjgl/lwjgl/lwjgl-platform/2.9.4-ni…
C:\Pylo\MCreator165\forge\build\sources\main\java\mod\mcreator\TestEnvironmentMod.java:106: error: cannot find symbol
    mcreator_dES mcreator_0 = new mcreator_dES();
    ^
  symbol:   class mcreator_dES
  location: class TestEnvironmentMod
C:\Pylo\MCreator165\forge\build\sources\main\java\mod\mcreator\TestEnvironmentMod.java:107: error: cannot find symbol
mcreator_dEP mcreator_1 = new mcreator_dEP();
^
  symbol:   class mcreator_dEP
  location: class TestEnvironmentMod
C:\Pylo\MCreator165\forge\build\sources\main\java\mod\mcreator\TestEnvironmentMod.java:108: error: cannot find symbol
mcreator_dEA mcreator_2 = new mcreator_dEA();
^
  symbol:   class mcreator_dEA
  location: class TestEnvironmentMod
C:\Pylo\MCreator165\forge\build\sources\main\java\mod\mcreator\TestEnvironmentMod.java:109: error: cannot find symbol
mcreator_emeralDangeon mcreator_3 = new mcreator_emeralDangeon();
^
  symbol:   class mcreator_emeralDangeon
  location: class TestEnvironmentMod
C:\Pylo\MCreator165\forge\build\sources\main\java\mod\mcreator\TestEnvironmentMod.java:110: error: cannot find symbol
mcreator_d1 mcreator_4 = new mcreator_d1();
^
  symbol:   class mcreator_d1
  location: class TestEnvironmentMod
C:\Pylo\MCreator165\forge\build\sources\main\java\mod\mcreator\TestEnvironmentMod.java:111: error: cannot find symbol
mcreator_ruin mcreator_5 = new mcreator_ruin();
^
  symbol:   class mcreator_ruin
  location: class TestEnvironmentMod
C:\Pylo\MCreator165\forge\build\sources\main\java\mod\mcreator\TestEnvironmentMod.java:112: error: cannot find symbol
mcreator_glas mcreator_6 = new mcreator_glas();
^
  symbol:   class mcreator_glas
  location: class TestEnvironmentMod
C:\Pylo\MCreator165\forge\build\sources\main\java\mod\mcreator\TestEnvironmentMod.java:113: error: cannot find symbol
mcreator_infectedwater mcreator_7 = new mcreator_infectedwater();
^
  symbol:   class mcreator_infectedwater
  location: class TestEnvironmentMod
C:\Pylo\MCreator165\forge\build\sources\main\java\mod\mcreator\TestEnvironmentMod.java:114: error: cannot find symbol
mcreator_infectedblock mcreator_8 = new mcreator_infectedblock();
^
  symbol:   class mcreator_infectedblock
  location: class TestEnvironmentMod
C:\Pylo\MCreator165\forge\build\sources\main\java\mod\mcreator\TestEnvironmentMod.java:115: error: cannot find symbol
mcreator_infectedbiome mcreator_9 = new mcreator_infectedbiome();
^
  symbol:   class mcreator_infectedbiome
  location: class TestEnvironmentMod
C:\Pylo\MCreator165\forge\build\sources\main\java\mod\mcreator\TestEnvironmentMod.java:116: error: cannot find symbol
mcreator_iD mcreator_10 = new mcreator_iD();
^
  symbol:   class mcreator_iD
  location: class TestEnvironmentMod
C:\Pylo\MCreator165\forge\build\sources\main\java\mod\mcreator\TestEnvironmentMod.java:106: error: cannot find symbol
    mcreator_dES mcreator_0 = new mcreator_dES();
                                  ^
  symbol:   class mcreator_dES
  location: class TestEnvironmentMod
C:\Pylo\MCreator165\forge\build\sources\main\java\mod\mcreator\TestEnvironmentMod.java:107: error: cannot find symbol
mcreator_dEP mcreator_1 = new mcreator_dEP();
                              ^
  symbol:   class mcreator_dEP
  location: class TestEnvironmentMod
C:\Pylo\MCreator165\forge\build\sources\main\java\mod\mcreator\TestEnvironmentMod.java:108: error: cannot find symbol
mcreator_dEA mcreator_2 = new mcreator_dEA();
                              ^
  symbol:   class mcreator_dEA
  location: class TestEnvironmentMod
C:\Pylo\MCreator165\forge\build\sources\main\java\mod\mcreator\TestEnvironmentMod.java:109: error: cannot find symbol
mcreator_emeralDangeon mcreator_3 = new mcreator_emeralDangeon();
                                        ^
  symbol:   class mcreator_emeralDangeon
  location: class TestEnvironmentMod
C:\Pylo\MCreator165\forge\build\sources\main\java\mod\mcreator\TestEnvironmentMod.java:110: error: cannot find symbol
mcreator_d1 mcreator_4 = new mcreator_d1();
                             ^
  symbol:   class mcreator_d1
  location: class TestEnvironmentMod
C:\Pylo\MCreator165\forge\build\sources\main\java\mod\mcreator\TestEnvironmentMod.java:111: error: cannot find symbol
mcreator_ruin mcreator_5 = new mcreator_ruin();
                               ^
  symbol:   class mcreator_ruin
  location: class TestEnvironmentMod
C:\Pylo\MCreator165\forge\build\sources\main\java\mod\mcreator\TestEnvironmentMod.java:112: error: cannot find symbol
mcreator_glas mcreator_6 = new mcreator_glas();
                               ^
  symbol:   class mcreator_glas
  location: class TestEnvironmentMod
C:\Pylo\MCreator165\forge\build\sources\main\java\mod\mcreator\TestEnvironmentMod.java:113: error: cannot find symbol
mcreator_infectedwater mcreator_7 = new mcreator_infectedwater();
                                        ^
  symbol:   class mcreator_infectedwater
  location: class TestEnvironmentMod
C:\Pylo\MCreator165\forge\build\sources\main\java\mod\mcreator\TestEnvironmentMod.java:114: error: cannot find symbol
mcreator_infectedblock mcreator_8 = new mcreator_infectedblock();
                                        ^
  symbol:   class mcreator_infectedblock
  location: class TestEnvironmentMod
C:\Pylo\MCreator165\forge\build\sources\main\java\mod\mcreator\TestEnvironmentMod.java:115: error: cannot find symbol
mcreator_infectedbiome mcreator_9 = new mcreator_infectedbiome();
                                        ^
  symbol:   class mcreator_infectedbiome
  location: class TestEnvironmentMod
C:\Pylo\MCreator165\forge\build\sources\main\java\mod\mcreator\TestEnvironmentMod.java:116: error: cannot find symbol
mcreator_iD mcreator_10 = new mcreator_iD();
                              ^
  symbol:   class mcreator_iD
  location: class TestEnvironmentMod
22 errors
:compileJava FAILED
FAILURE: Build failed with an exception.
* What went wrong:
Execution failed for task ':compileJava'.
> Compilation failed; see the compiler error output for details.
* Try:
Run with --stacktrace option to get the stack trace. Run with --info or --debug option to get more log output.
BUILD FAILED
Total time: 3 mins 7.739 secs
C:\Pylo\MCreator165\forge>
Task completed with return code 0 in 188520 milliseconds

 can help?