MCreator not work. What to do?

Started by EXsess on Tue, 03/01/2016 - 15:10
Last seen on 18:32, 1. May 2018
Joined Oct 2014
User points:

Statistics:

  • Comments:
  • Forum topics:
  • Modifications:
  • Wiki pages:
MCreator not work. What to do?
Tue, 03/01/2016 - 15:10

   
Executing gradle command: clean build
Microsoft Windows [Version 6.1.7601]
(c) Љ®аЇ®а жЁп Њ ©Єа®б®дв (Microsoft Corp.), 2009. ‚ᥠЇа ў  § йЁйҐ­л.
C:\Pylo\Mcreator189>cd forge
C:\Pylo\Mcreator189\forge>SET "JAVA_HOME=C:\Pylo\Mcreator189\jdk64\"
C:\Pylo\Mcreator189\forge>SET JAVA_EXE=%JAVA_HOME%\bin\java.exe
C:\Pylo\Mcreator189\forge>SET PATH=%JAVA_HOME%\bin\;%PATH%
C:\Pylo\Mcreator189\forge>SET "JAVA_OPTS=-Xmx2048m -Xms625m"
C:\Pylo\Mcreator189\forge>gradlew clean build
java.net.ConnectException: Connection timed out: connect
    at java.net.DualStackPlainSocketImpl.connect0(Native Method)
    at java.net.DualStackPlainSocketImpl.socketConnect(DualStackPlainSocketImpl.java:79)
    at java.net.AbstractPlainSocketImpl.doConnect(AbstractPlainSocketImpl.java:339)
    at java.net.AbstractPlainSocketImpl.connectToAddress(AbstractPlainSocketImpl.java:200)
    at java.net.AbstractPlainSocketImpl.connect(AbstractPlainSocketImpl.java:182)
    at java.net.PlainSocketImpl.connect(PlainSocketImpl.java:172)
    at java.net.SocksSocketImpl.connect(SocksSocketImpl.java:392)
    at java.net.Socket.connect(Socket.java:579)
    at java.net.Socket.connect(Socket.java:528)
    at sun.net.NetworkClient.doConnect(NetworkClient.java:180)
    at sun.net.www.http.HttpClient.openServer(HttpClient.java:432)
    at sun.net.www.http.HttpClient.openServer(HttpClient.java:527)
    at sun.net.www.http.HttpClient.<init&gt;(HttpClient.java:211)
    at sun.net.www.http.HttpClient.New(HttpClient.java:308)
    at sun.net.www.http.HttpClient.New(HttpClient.java:326)
    at sun.net.www.protocol.http.HttpURLConnection.getNewHttpClient(HttpURLConnection…
    at sun.net.www.protocol.http.HttpURLConnection.plainConnect(HttpURLConnection.java…
    at sun.net.www.protocol.http.HttpURLConnection.connect(HttpURLConnection.java:851)
    at net.minecraftforge.gradle.common.BasePlugin.getWithEtag(BasePlugin.java:638)
    at net.minecraftforge.gradle.common.BasePlugin.setVersionInfoJson(BasePlugin.java:204)
    at net.minecraftforge.gradle.common.BasePlugin.apply(BasePlugin.java:167)
    at net.minecraftforge.gradle.common.BasePlugin.apply(BasePlugin.java:87)
    at org.gradle.api.internal.plugins.ImperativeOnlyPluginApplicator.applyImperative(ImperativeOnlyPluginApplicator.java:35)
    at org.gradle.api.internal.plugins.RuleBasedPluginApplicator.applyImperative(RuleBasedPluginApplicator.java:43)
    at org.gradle.api.internal.plugins.DefaultPluginManager.doApply(DefaultPluginManager.java:144)
    at org.gradle.api.internal.plugins.DefaultPluginManager.apply(DefaultPluginManager.java:112)
    at org.gradle.api.internal.plugins.DefaultObjectConfigurationAction.applyType(DefaultObjectConfigurationAction.java:112)
    at org.gradle.api.internal.plugins.DefaultObjectConfigurationAction.access$200(DefaultObjectConfigurationAction.java:35)
    at org.gradle.api.internal.plugins.DefaultObjectConfigurationAction$3.run(DefaultObjectConfigurationAction.java:79)
    at org.gradle.api.internal.plugins.DefaultObjectConfigurationAction.execute(DefaultObjectConfigurationAction.java:135)
    at org.gradle.api.internal.project.AbstractPluginAware.apply(AbstractPluginAware.java:46)
    at org.gradle.api.plugins.PluginAware$apply.call(Unknown Source)
    at org.codehaus.groovy.runtime.callsite.CallSiteArray.defaultCall(CallSiteArray.java:45)
    at org.codehaus.groovy.runtime.callsite.AbstractCallSite.call(AbstractCallSite.java:108)
    at org.codehaus.groovy.runtime.callsite.AbstractCallSite.call(AbstractCallSite.java:116)
    at org.gradle.api.internal.project.ProjectScript.apply(ProjectScript.groovy:34)
    at org.gradle.api.Script$apply$0.callCurrent(Unknown Source)
    at org.codehaus.groovy.runtime.callsite.CallSiteArray.defaultCallCurrent(CallSiteArray.java:49)
    at org.codehaus.groovy.runtime.callsite.AbstractCallSite.callCurrent(AbstractCallSite.java:133)
    at org.codehaus.groovy.runtime.callsite.AbstractCallSite.callCurrent(AbstractCallSite.java:141)
    at build_dtrjlz2xi28n5kg7xw5ffim59.run(C:\Pylo\Mcreator189\forge\build.gradle:15)
    at org.gradle.groovy.scripts.internal.DefaultScriptRunnerFactory$ScriptRunnerImpl.run(DefaultScriptRunnerFactory.java:91)
    at org.gradle.configuration.DefaultScriptPluginFactory$ScriptPluginImpl$1.run(DefaultScriptPluginFactory.java:148)
    at org.gradle.configuration.ProjectScriptTarget.addConfiguration(ProjectScriptTarget.java:72)
    at org.gradle.configuration.DefaultScriptPluginFactory$ScriptPluginImpl.apply(DefaultScriptPluginFactory.java:153)
    at org.gradle.configuration.project.BuildScriptProcessor.execute(BuildScriptProcessor.java:38)
    at org.gradle.configuration.project.BuildScriptProcessor.execute(BuildScriptProcessor.java:25)
    at org.gradle.configuration.project.ConfigureActionsProjectEvaluator.evaluate(ConfigureActionsProjectEvaluator.java:34)
    at org.gradle.configuration.project.LifecycleProjectEvaluator.evaluate(LifecycleProjectEvaluator.java:55)
    at org.gradle.api.internal.project.AbstractProject.evaluate(AbstractProject.java:491)
    at org.gradle.api.internal.project.AbstractProject.evaluate(AbstractProject.java:89)
    at org.gradle.execution.TaskPathProjectEvaluator.configureHierarchy(TaskPathProjectEvaluator.java:42)
    at org.gradle.configuration.DefaultBuildConfigurer.configure(DefaultBuildConfigurer.java:35)
    at org.gradle.initialization.DefaultGradleLauncher$2.run(DefaultGradleLauncher.java:126)
    at org.gradle.internal.Factories$1.create(Factories.java:22)
    at org.gradle.internal.progress.DefaultBuildOperationExecutor.run(DefaultBuildOperationExecutor.java:90)
    at org.gradle.internal.progress.DefaultBuildOperationExecutor.run(DefaultBuildOperationExecutor.java:52)
    at org.gradle.initialization.DefaultGradleLauncher.doBuildStages(DefaultGradleLauncher.java:123)
    at org.gradle.initialization.DefaultGradleLauncher.access$200(DefaultGradleLauncher.java:33)
    at org.gradle.initialization.DefaultGradleLauncher$1.create(DefaultGradleLauncher.java:100)
    at org.gradle.initialization.DefaultGradleLauncher$1.create(DefaultGradleLauncher.java:94)
    at org.gradle.internal.progress.DefaultBuildOperationExecutor.run(DefaultBuildOperationExecutor.java:90)
    at org.gradle.internal.progress.DefaultBuildOperationExecutor.run(DefaultBuildOperationExecutor.java:62)
    at org.gradle.initialization.DefaultGradleLauncher.doBuild(DefaultGradleLauncher.java:94)
    at org.gradle.initialization.DefaultGradleLauncher.run(DefaultGradleLauncher.java:83)
    at org.gradle.launcher.exec.InProcessBuildActionExecuter$DefaultBuildController.run(InProcessBuildActionExecuter.java:94)
    at org.gradle.tooling.internal.provider.ExecuteBuildActionRunner.run(ExecuteBuildActionRunner.java:28)
    at org.gradle.launcher.exec.ChainingBuildActionRunner.run(ChainingBuildActionRunner.java:35)
    at org.gradle.launcher.exec.InProcessBuildActionExecuter.execute(InProcessBuildActionExecuter.java:43)
    at org.gradle.launcher.exec.InProcessBuildActionExecuter.execute(InProcessBuildActionExecuter.java:28)
    at org.gradle.launcher.exec.ContinuousBuildActionExecuter.execute(ContinuousBuildActionExecuter.java:77)
    at org.gradle.launcher.exec.ContinuousBuildActionExecuter.execute(ContinuousBuildActionExecuter.java:47)
    at org.gradle.launcher.exec.DaemonUsageSuggestingBuildActionExecuter.execute(DaemonUsageSuggestingBuildActionExecuter.java:51)
    at org.gradle.launcher.exec.DaemonUsageSuggestingBuildActionExecuter.execute(DaemonUsageSuggestingBuildActionExecuter.java:28)
    at org.gradle.launcher.cli.RunBuildAction.run(RunBuildAction.java:43)
    at org.gradle.internal.Actions$RunnableActionAdapter.execute(Actions.java:170)
    at org.gradle.launcher.cli.CommandLineActionFactory$ParseAndBuildAction.execute(CommandLineActionFactory.java:237)
    at org.gradle.launcher.cli.CommandLineActionFactory$ParseAndBuildAction.execute(CommandLineActionFactory.java:210)
    at org.gradle.launcher.cli.JavaRuntimeValidationAction.execute(JavaRuntimeValidationAction.java:35)
    at org.gradle.launcher.cli.JavaRuntimeValidationAction.execute(JavaRuntimeValidationAction.java:24)
    at org.gradle.launcher.cli.CommandLineActionFactory$WithLogging.execute(CommandLineActionFactory.java:206)
    at org.gradle.launcher.cli.CommandLineActionFactory$WithLogging.execute(CommandLineActionFactory.java:169)
    at org.gradle.launcher.cli.ExceptionReportingAction.execute(ExceptionReportingAction.java:33)
    at org.gradle.launcher.cli.ExceptionReportingAction.execute(ExceptionReportingAction.java:22)
    at org.gradle.launcher.Main.doAction(Main.java:33)
    at org.gradle.launcher.bootstrap.EntryPoint.run(EntryPoint.java:45)
    at sun.reflect.NativeMethodAccessorImpl.invoke0(Native Method)
    at sun.reflect.NativeMethodAccessorImpl.invoke(NativeMethodAccessorImpl.java:57)
    at sun.reflect.DelegatingMethodAccessorImpl.invoke(DelegatingMethodAccessorImpl.java:43)
    at java.lang.reflect.Method.invoke(Method.java:606)
    at org.gradle.launcher.bootstrap.ProcessBootstrap.runNoExit(ProcessBootstrap.java:54)
    at org.gradle.launcher.bootstrap.ProcessBootstrap.run(ProcessBootstrap.java:35)
    at org.gradle.launcher.GradleMain.main(GradleMain.java:23)
    at sun.reflect.NativeMethodAccessorImpl.invoke0(Native Method)
    at sun.reflect.NativeMethodAccessorImpl.invoke(NativeMethodAccessorImpl.java:57)
    at sun.reflect.DelegatingMethodAccessorImpl.invoke(DelegatingMethodAccessorImpl.java:43)
    at java.lang.reflect.Method.invoke(Method.java:606)
    at org.gradle.wrapper.BootstrapMainStarter.start(BootstrapMainStarter.java:30)
    at org.gradle.wrapper.WrapperExecutor.execute(WrapperExecutor.java:127)
    at org.gradle.wrapper.GradleWrapperMain.main(GradleWrapperMain.java:61)
BUILD FAILED
Total time: 26.461 secs
FAILURE: Build failed with an exception.
* Where:
Build file 'C:\Pylo\Mcreator189\forge\build.gradle' line: 15
* What went wrong:
A problem occurred evaluating root project 'forge'.
> Failed to apply plugin [id 'net.minecraftforge.gradle.forge']
   > Unable to obtain url (http://export.mcpbot.bspk.rs/versions.json) with etag!
* Try:
Run with --stacktrace option to get the stack trace. Run with --info or --debug option to get more log output.
C:\Pylo\Mcreator189\forge>
Task completed with return code 0 in 27190 milliseconds