ITEM CREATION ERROR. PLZ HELP

Started by CallumSomerfield on Sat, 03/26/2016 - 05:10

Topic category: Help with MCreator modding

Last seen on 10:04, 11. Jul 2019
Joined Mar 2016
User points:

Statistics:

  • Comments:
  • Forum topics:
  • Modifications:
  • Wiki pages:
ITEM CREATION ERROR. PLZ HELP
Sat, 03/26/2016 - 21:18 (edited)

Hello

I only just downloaded MCreator yesterday, so I am still new to the program

So when I try to make a item, tool, armor set etc. and put it's crafting recipe everything works fine. Then when i go back into the crafting recipe, the output box is empty?? Then when i try to export my mod to a zip file the following message occurs

"Your mod contains errors and could not be exported. No mod file was generated."

Edit:

This may be the cause:

C:\Pylo\MCreator165\forge\build\sources\main\java\mod\mcreator\TestEnvironmentMod.java:107: error: cannot find symbol
mcreator_extraStrong mcreator_1 = new mcreator_extraStrong();
^
  symbol:   class mcreator_extraStrong
  location: class TestEnvironmentMod
C:\Pylo\MCreator165\forge\build\sources\main\java\mod\mcreator\TestEnvironmentMod.java:107: error: cannot find symbol
mcreator_extraStrong mcreator_1 = new mcreator_extraStrong();
                                      ^
  symbol:   class mcreator_extraStrong
  location: class TestEnvironmentMod
C:\Pylo\MCreator165\forge\build\sources\main\java\mod\mcreator\mcreator_reinforcedDiamond.java:152: error: cannot find symbol
if(entity instanceof EntityPlayer)((EntityPlayer)entity).addStat(mcreator_extraStrong.achievement, 1);
                                                                 ^
  symbol:   variable mcreator_extraStrong
  location: class ItemreinforcedDiamond
C:\Pylo\MCreator165\forge\build\sources\main\java\mod\mcreator\mcreator_extraStrong.java:95: error: cannot find symbol
public Object instance;public static Achievement achievement = (new Achievement("achievement.extraStrong", "extraStrong", 0, 0, mcreator_reinforcedDiamond.block, (Achievement)null));
                                                                                                                                ^
  symbol:   variable mcreator_reinforcedDiamond
  location: class mcreator_extraStrong
4 errors
:compileJava FAILED
FAILURE: Build failed with an exception.
* What went wrong:
Execution failed for task ':compileJava'.
> Compilation failed; see the compiler error output for details.
* Try:
Run with --stacktrace option to get the stack trace. Run with --info or --debug option to get more log output

.BUILD FAILED
Total time: 45.692 secs
C:\Pylo\MCreator165\forge>
Task completed with return code 0 in 46319 milliseconds

 

Can someone PLEASE help me!! Thanks

Edited by CallumSomerfield on Sat, 03/26/2016 - 21:18