i can't test my mod and am getting an error [FIXED]

Started by akcool on Fri, 07/01/2016 - 01:08

Topic category: Help with MCreator's application

Last seen on 17:54, 1. Jul 2016
Joined Jul 2016
User points:

Statistics:

  • Comments:
  • Forum topics:
  • Modifications:
  • Wiki pages:
i can't test my mod and am getting an error [FIXED]
Fri, 07/01/2016 - 04:37 (edited)

every time i run something like the server or the client  and  each time i get some thing like this

 

 

MCreator Console 1.02
   
Executing gradle command: clean runClient
Microsoft Windows [Version 10.0.10586]
(c) 2015 Microsoft Corporation. All rights reserved.
C:\Pylo\MCreator169>cd forge
C:\Pylo\MCreator169\forge>SET "JAVA_HOME=C:\Pylo\MCreator169\jdk32\"
C:\Pylo\MCreator169\forge>SET JAVA_EXE=%JAVA_HOME%\bin\java.exe
C:\Pylo\MCreator169\forge>SET PATH=%JAVA_HOME%\bin\;%PATH%
C:\Pylo\MCreator169\forge>SET "JAVA_OPTS=-Xmx1024m -Xms512m"
C:\Pylo\MCreator169\forge>gradlew clean runClient
#################################################
         ForgeGradle 2.2-SNAPSHOT-59f33ec        
  https://github.com/MinecraftForge/ForgeGradle  
#################################################
               Powered by MCP unknown               
             http://modcoderpack.com             
         by: Searge, ProfMobius, Fesh0r,         
         R4wk, ZeuX, IngisKahn, bspkrs           
#################################################
:clean UP-TO-DATE
:deobfCompileDummyTask
:deobfProvidedDummyTask
FAILURE: Build failed with an exception.
:getVersionJson
* Wjava.io.FileNotFBUILD FAILED
oundException: C:\Pylo\MCreator169\forge\.gradle\2.7\taskArtifacts\cache.properties (The system cannot find the file specified)
hat> C:\Pylo\MCreator169\forge\.gradle\2.7\taskArtifacts\cache.properties (The system cannot find the file specified)
 went wrong:
Total time: 14.96 secs
* Try:
Run with --stacktrace option to get the stack trace. Run with --info or --debug option to get more log output.
C:\Pylo\MCreator169\forge>
Task completed with return code 0 in 15805 milliseconds

 

Edited by akcool on Fri, 07/01/2016 - 04:37
Last seen on 17:54, 1. Jul 2016
Joined Jul 2016
User points:

Statistics:

  • Comments:
  • Forum topics:
  • Modifications:
  • Wiki pages:
it ends up i had the 32 bit
Fri, 07/01/2016 - 04:38

it ends up i had the 32 bit  version and i upgraed to the 64bit and it worked