Export Problems

Started by SpartCrafter on Thu, 09/08/2016 - 22:05

Topic category: Bugs and solutions

Last seen on 22:31, 26. Oct 2016
Joined May 2016
User points:

Statistics:

  • Comments:
  • Forum topics:
  • Modifications:
  • Wiki pages:
Export Problems
Thu, 09/08/2016 - 22:05

I have the 1.6.9 version of MCreator but when I try to export the mod appears this:

Your mod contain errors and could not be exported.

No mod file was generated.

~~~~~~~~~~~~~~~~~~~~~~~~~~~~~~~~~~~~~~~~~~~~~~~~~~~~~

All mods I created this happens.

Last seen on 00:21, 11. Aug 2019
Joined Aug 2013
User points:

Statistics:

  • Comments:
  • Forum topics:
  • Modifications:
  • Wiki pages:
  • wiki contributor
  • moderator
In the console should be
Thu, 09/08/2016 - 22:11

In the console should be printed the errors , can I see them?

Last seen on 22:31, 26. Oct 2016
Joined May 2016
User points:

Statistics:

  • Comments:
  • Forum topics:
  • Modifications:
  • Wiki pages:
RE:In the console should be
Thu, 09/08/2016 - 22:18

@#1

MCreator Console 1.02
   
Executing gradle command: clean build
Microsoft Windows [versÆo 6.3.9600]
(c) 2013 Microsoft Corporation. Todos os direitos reservados.
C:\Pylo\MCreator169>cd forge
C:\Pylo\MCreator169\forge>SET "JAVA_HOME=C:\Pylo\MCreator169\jdk64\"
C:\Pylo\MCreator169\forge>SET JAVA_EXE=%JAVA_HOME%\bin\java.exe
C:\Pylo\MCreator169\forge>SET PATH=%JAVA_HOME%\bin\;%PATH%
C:\Pylo\MCreator169\forge>SET "JAVA_OPTS=-Xmx2048m -Xms625m"
C:\Pylo\MCreator169\forge>gradlew clean build
#################################################
         ForgeGradle 2.2-SNAPSHOT-c438b06        
  https://github.com/MinecraftForge/ForgeGradle  
#################################################
               Powered by MCP unknown               
             http://modcoderpack.com             
         by: Searge, ProfMobius, Fesh0r,         
         R4wk, ZeuX, IngisKahn, bspkrs           
#################################################
:clean UP-TO-DATE
:deobfCompileDummyTask
FAILURE: Build failed with an exception.
* What went wrong:
java.io.FileNotFoundException: C:\Pylo\MCreator169\forge\.gradle\2.7\taskArtifacts\cache.properties (O sistema não pode encontrar o arquivo especificado)
> C:\Pylo\MCreator169\forge\.gradle\2.7\taskArtifacts\cache.properties (O sistema não pode encontrar o arquivo especificado)
* Try:
Run with --stacktrace option to get the stack trace. Run with --info or --debug option to get more log output.
:getVersionJson
BUILD FAILED
Total time: 51.899 secs
C:\Pylo\MCreator169\forge>
Task completed with return code 0 in 53940 milliseconds

Last seen on 22:31, 26. Oct 2016
Joined May 2016
User points:

Statistics:

  • Comments:
  • Forum topics:
  • Modifications:
  • Wiki pages:
RE:In the console should be
Thu, 09/08/2016 - 22:32

@#1

Translated to english:

MCreator Console 1.02
   
Executing gradle command: clean build
Microsoft Windows [versÆo 6.3.9600]
(c) 2013 Microsoft Corporation. All rights reserved.
C:\Pylo\MCreator169>cd forge
C:\Pylo\MCreator169\forge>SET "JAVA_HOME=C:\Pylo\MCreator169\jdk64\"
C:\Pylo\MCreator169\forge>SET JAVA_EXE=%JAVA_HOME%\bin\java.exe
C:\Pylo\MCreator169\forge>SET PATH=%JAVA_HOME%\bin\;%PATH%
C:\Pylo\MCreator169\forge>SET "JAVA_OPTS=-Xmx2048m -Xms625m"
C:\Pylo\MCreator169\forge>gradlew clean build
#################################################
         ForgeGradle 2.2-SNAPSHOT-c438b06        
  https://github.com/MinecraftForge/ForgeGradle  
#################################################
               Powered by MCP unknown               
             http://modcoderpack.com             
         by: Searge, ProfMobius, Fesh0r,         
         R4wk, ZeuX, IngisKahn, bspkrs           
#################################################
:clean UP-TO-DATE
:deobfCompileDummyTask
FAILURE: Build failed with an exception.
* What went wrong:
java.io.FileNotFoundException: C:\Pylo\MCreator169\forge\.gradle\2.7\taskArtifacts\cache.properties (The system can't found the specified file)
> C:\Pylo\MCreator169\forge\.gradle\2.7\taskArtifacts\cache.properties (The system can't found the specified file)
* Try:
Run with --stacktrace option to get the stack trace. Run with --info or --debug option to get more log output.
:getVersionJson
BUILD FAILED
Total time: 51.899 secs
C:\Pylo\MCreator169\forge>
Task completed with return code 0 in 53940 milliseconds