Armour Causing Mod to not Compile

Started by SackboyGamerYT on Wed, 09/14/2016 - 09:55

Topic category: General discussion

Last seen on 10:15, 29. Mar 2017
Joined Sep 2016
User points:

Statistics:

  • Comments:
  • Forum topics:
  • Modifications:
  • Wiki pages:
Armour Causing Mod to not Compile
Wed, 09/14/2016 - 10:15 (edited)

Hi! i am trying to Make a Mod for me and my brother, i am trying to add some Armor in, but every time i add a new Armor in and try to Compile, it wont Compile and errors, 

Can someone Help me please?

   
 
Executing gradle command: clean build
Microsoft Windows [Version 10.0.14393]
(c) 2016 Microsoft Corporation. All rights reserved.
C:\Pylo\MCreator170>cd forge
C:\Pylo\MCreator170\forge>SET "JAVA_HOME=C:\Pylo\MCreator170\jdk64\"
C:\Pylo\MCreator170\forge>SET JAVA_EXE=%JAVA_HOME%\bin\java.exe
C:\Pylo\MCreator170\forge>SET PATH=%JAVA_HOME%\bin\;%PATH%
C:\Pylo\MCreator170\forge>gradlew -Dorg.gradle.jvmargs="-Xms625m -Xmx2048m" clean build
To honour the JVM settings for this build a new JVM will be forked. Please consider using the daemon: https://docs.gradle.org/2.7/userguide/gradle_daemon.html.
This mapping 'snapshot_20160518' was designed for MC 1.9.4! Use at your own peril.
#################################################
         ForgeGradle 2.2-SNAPSHOT-c438b06        
  https://github.com/MinecraftForge/ForgeGradle  
#################################################
               Powered by MCP unknown               
             http://modcoderpack.com             
         by: Searge, ProfMobius, Fesh0r,         
         R4wk, ZeuX, IngisKahn, bspkrs           
#################################################
:clean
:deobfCompileDummyTask
:deobfProvidedDummyTask
:sourceApiJava
:compileApiJava UP-TO-DATE
:processApiResources UP-TO-DATE
:apiClasses UP-TO-DATE
:sourceMainJava
C:\Pylo\MCreator170\forge\build\sources\main\java\mod\mcreator\MoreItems.java:59: error: cannot find symbol
    mcreator_oldIron mcreator_20 = new mcreator_oldIron();
    ^
  symbol:   class mcreator_oldIron
  location: class MoreItems
C:\Pylo\MCreator170\forge\build\sources\main\java\mod\mcreator\MoreItems.java:59: error: cannot find symbol
    mcreator_oldIron mcreator_20 = new mcreator_oldIron();
                                       ^
  symbol:   class mcreator_oldIron
  location: class MoreItems
2 errors
:compileJava FAILED
FAILURE: Build failed with an exception.
* What went wrong:
Execution failed for task ':compileJava'.
> Compilation failed; see the compiler error output for details.
* Try:
Run with --stacktrace option to get the stack trace. Run with --info or --debug option to get more log output.
BUILD FAILED
Total time: 37.298 secs
C:\Pylo\MCreator170\forge>
Task completed with return code 0 in 39083 milliseconds

   
 

 

Edited by SackboyGamerYT on Wed, 09/14/2016 - 10:15