MCreator setup failed!

Started by Spore The Saiyan on Sun, 09/18/2016 - 05:05

Topic category: Bugs and solutions

Last seen on 00:04, 22. Sep 2016
Joined Apr 2014
User points:

Statistics:

  • Comments:
  • Forum topics:
  • Modifications:
  • Wiki pages:
MCreator setup failed!
Sun, 09/18/2016 - 05:05

I am trying to install mcreator. When I loaded the application after installing it, an error box popped up. Here is the error I could copy:

   
Executing gradle command: cleanCache clean setupDecompWorkspace --refresh-dependencies
Microsoft Windows [Version 10.0.10240]
(c) 2015 Microsoft Corporation. All rights reserved.
C:\Pylo\MCreator170>cd forge
C:\Pylo\MCreator170\forge>SET "JAVA_HOME=C:\Pylo\MCreator170\jdk64\"
C:\Pylo\MCreator170\forge>SET JAVA_EXE=%JAVA_HOME%\bin\java.exe
C:\Pylo\MCreator170\forge>SET PATH=%JAVA_HOME%\bin\;%PATH%
C:\Pylo\MCreator170\forge>gradlew -Dorg.gradle.jvmargs="-Xms625m -Xmx2048m" cleanCache clean setupDecompWorkspace --refresh-dependencies
To honour the JVM settings for this build a new JVM will be forked. Please consider using the daemon: https://docs.gradle.org/2.7/userguide/gradle_daemon.html.
FAILURE: Build failed with an exception.
* What went wrong:
Unable to start the daemon process.
This problem might be caused by incorrect configuration of the daemon.
For example, an unrecognized jvm option is used.
Please refer to the user guide chapter on the daemon at https://docs.gradle.org/2.7/userguide/gradle_daemon.html
Please read the following process output to find out more:
-----------------------
Error occurred during initialization of VM
Could not reserve enough space for object heap
* Try:
Run with --stacktrace option to get the stack trace. Run with --info or --debug option to get more log output.
C:\Pylo\MCreator170\forge>
Task completed with return code 0 in 14612 milliseconds

What does it mean? I would very much like to resolve this error so I can start using this program :)

Last seen on 00:04, 22. Sep 2016
Joined Apr 2014
User points:

Statistics:

  • Comments:
  • Forum topics:
  • Modifications:
  • Wiki pages:
RE:http://stackoverflow.com
Sun, 09/18/2016 - 20:52

@#1

I appreciate the reply, but I am completely clueless on what I am supposed to do with that link. I don't ndersttaand what any of the people on that forum are saying, I still have no idea what to do.

Last seen on 00:04, 22. Sep 2016
Joined Apr 2014
User points:

Statistics:

  • Comments:
  • Forum topics:
  • Modifications:
  • Wiki pages:
Bump
Mon, 09/19/2016 - 03:23

Bump

Last seen on 00:04, 22. Sep 2016
Joined Apr 2014
User points:

Statistics:

  • Comments:
  • Forum topics:
  • Modifications:
  • Wiki pages:
Bump
Tue, 09/20/2016 - 02:31

Bump

Last seen on 00:04, 22. Sep 2016
Joined Apr 2014
User points:

Statistics:

  • Comments:
  • Forum topics:
  • Modifications:
  • Wiki pages:
I found the solution! (Did
Wed, 09/21/2016 - 22:14

I found the solution! (Did some digging starting with @strangest's link, thanks man)

 

Strangely enough, the solution for me was to install a defragging program (Defraggler from Priform) and defrag my computer. After that, the installation was complete!

 

I'm leaving this here so people who need answers in the future can see it.

Last seen on 00:04, 22. Sep 2016
Joined Apr 2014
User points:

Statistics:

  • Comments:
  • Forum topics:
  • Modifications:
  • Wiki pages:
RE:I found the solution! (Did
Wed, 09/21/2016 - 22:15

@#4

 

*Piriform

Last seen on 00:52, 10. Mar 2017
Joined Jun 2016
User points:

Statistics:

  • Comments:
  • Forum topics:
  • Modifications:
  • Wiki pages:
I had also the same problem.
Fri, 12/23/2016 - 02:22

I had also the same problem. There's the error log.

[spoiler][/spoiler]   
Executing gradle command: cleanCache clean setupDecompWorkspace --refresh-dependencies
Microsoft Windows [Version 6.1.7601]
Copyright (c) 2009 Microsoft Corporation.  All rights reserved.
C:\Pylo\MCreator171>cd forge
C:\Pylo\MCreator171\forge>SET "JAVA_HOME=C:\Pylo\MCreator171\jdk32\"
C:\Pylo\MCreator171\forge>SET JAVA_EXE=%JAVA_HOME%\bin\java.exe
C:\Pylo\MCreator171\forge>SET PATH=%JAVA_HOME%\bin\;%PATH%
C:\Pylo\MCreator171\forge>gradlew -Dorg.gradle.jvmargs="-Xms512m -Xmx1024m" cleanCache clean setupDecompWorkspace --refresh-dependencies
Unzipping C:\Users\Toshiba\.gradle\wrapper\dists\gradle-2.14-bin\76oc0mnc3ieqtsukq90mp0rxk\gradle-2.14-bin.zip to C:\Users\Toshiba\.gradle\wrapper\dists\gradle-2.14-bin\76oc0mnc3ieqtsukq90mp0rxk
Exception in thread "main" java.util.zip.ZipException: error in opening zip file
   at java.util.zip.ZipFile.open(Native Method)
   at java.util.zip.ZipFile.(ZipFile.java:219)
   at java.util.zip.ZipFile.(ZipFile.java:149)
   at java.util.zip.ZipFile.(ZipFile.java:163)
   at org.gradle.wrapper.Install.unzip(Install.java:159)
   at org.gradle.wrapper.Install.access$500(Install.java:26)
   at org.gradle.wrapper.Install$1.call(Install.java:69)
   at org.gradle.wrapper.Install$1.call(Install.java:46)
   at org.gradle.wrapper.ExclusiveFileAccessManager.access(ExclusiveFileAccessManager.java:65)
   at org.gradle.wrapper.Install.createDist(Install.java:46)
   at org.gradle.wrapper.WrapperExecutor.execute(WrapperExecutor.java:126)
   at org.gradle.wrapper.GradleWrapperMain.main(GradleWrapperMain.java:61)
C:\Pylo\MCreator171\forge>
Task completed with return code 0 in 406 milliseconds

 

Please. Find the solution. I have a mod to be updated.

Last seen on 16:00, 17. Sep 2018
Joined Sep 2018
User points:

Statistics:

  • Comments:
  • Forum topics:
  • Modifications:
  • Wiki pages:
Run An Old Version Of The…
Sun, 09/16/2018 - 19:30

Run An Old Version Of The Program It Can Work. If It Worked Tell Me :D :D 

Last seen on 23:21, 16. Jun 2019
Joined Oct 2018
User points:

Statistics:

  • Comments:
  • Forum topics:
  • Modifications:
  • Wiki pages:
I'm on Mac and I got this…
Tue, 10/23/2018 - 00:07

I'm on Mac and I got this error:

 

   
Executing gradle command: cleanCache clean setupDecompWorkspace --refresh-dependencies
Build info: MCreator 1.8.0, 64-bit, 4096 MB, Mac OS X, JVM 1.8.0_191
FAILURE: Build failed with an exception.
* What went wrong:
Could not determine java version from '11'.
* Try:
Run with --stacktrace option to get the stack trace. Run with --info or --debug option to get more log output.
Task completed with return code 1 in 3228 milliseconds

Any Mac users know how to fix it?