Help please, error. Worked fine then started to give error

Started by Bezik on Sun, 09/18/2016 - 14:19

Topic category: Help with MCreator's application

Last seen on 11:30, 12. Oct 2018
Joined Sep 2016
User points:

Statistics:

  • Comments:
  • Forum topics:
  • Modifications:
  • Wiki pages:
Help please, error. Worked fine then started to give error
Sun, 09/18/2016 - 14:19

   
Executing gradle command: build
Microsoft Windows [Version 6.1.7601]
(c) Љ®аЇ®а жЁп Њ ©Єа®б®дв (Microsoft Corp.), 2009. ‚ᥠЇа ў  § йЁйҐ­л.
C:\Pylo\MCreator163>cd forge
C:\Pylo\MCreator163\forge>SET "JAVA_HOME=C:\Pylo\MCreator163\jdk\"
C:\Pylo\MCreator163\forge>SET JAVA_EXE=%JAVA_HOME%\bin\java.exe
C:\Pylo\MCreator163\forge>SET PATH=%JAVA_HOME%\bin\;%PATH%
C:\Pylo\MCreator163\forge>gradlew build
****************************
 Powered By MCP:             
 http://modcoderpack.com/    
 Searge, ProfMobius, Fesh0r, 
 R4wk, ZeuX, IngisKahn, bspkrs
 MCP Data version : unknown
****************************
:compileApiJava UP-TO-DATE
:processApiResources UP-TO-DATE
:apiClasses UP-TO-DATE
:sourceMainJava UP-TO-DATE
:compileJava
:processResources UP-TO-DATE
:classes
:jar UP-TO-DATE
:compileTestJava UP-TO-DATE
:processTestResources UP-TO-DATE
:testClasses UP-TO-DATE
:test UP-TO-DATE
:extractMcpData UP-TO-DATE
:getVersionJson
:extractUserDev UP-TO-DATE
:genSrgs SKIPPED
:reobf FAILED
FAILURE: Build failed with an exception.
* What went wrong:
Execution failed for task ':reobf'.
> MALFORMED
* Try:
Run with --stacktrace option to get the stack trace. Run with --info or --debug option to get more log output.
BUILD FAILED
Total time: 12.321 secs
C:\Pylo\MCreator163\forge>
Task completed with return code 0 in 13023 milliseconds
Task return code check OK!

Last seen on 04:09, 13. Sep 2019
Joined Mar 2015
User points:

Statistics:

  • Comments:
  • Forum topics:
  • Modifications:
  • Wiki pages:
  • wiki contributor
  • moderator
try deleting the last mod you
Mon, 09/19/2016 - 02:53

try deleting the last mod you made in it and then see

Last seen on 00:21, 11. Aug 2019
Joined Aug 2013
User points:

Statistics:

  • Comments:
  • Forum topics:
  • Modifications:
  • Wiki pages:
  • wiki contributor
  • moderator
You can do as it says and try
Mon, 09/19/2016 - 13:27

You can do as it says and try it with a "--stacktrace" (Go to Tools ,Run Gradle Task, and use build --stacktrace ) , then paste here what it says.