Mcreater compileJava and symbol not fond error

Started by MonkeyWA on Sun, 10/30/2016 - 16:36

Topic category: Help with MCreator's application

Last seen on 02:23, 2. Nov 2016
Joined Aug 2016
User points:

Statistics:

  • Comments:
  • Forum topics:
  • Modifications:
  • Wiki pages:
Mcreater compileJava and symbol not fond error
Sun, 10/30/2016 - 16:53 (edited)

My mcreator has a weird problem involiving compileJava and symbol not found.

I reinstalled it, but it had the same error.

Here is the log:

   
Executing gradle command: clean build
Microsoft Windows [Version 10.0.14393]
(c) 2016 Microsoft Corporation. All rights reserved.
C:\Users\*****\Downloads\MCreator 1.7.0 [1.10.2] Windows 64bit>cd forge
C:\Users\*****\Downloads\MCreator 1.7.0 [1.10.2] Windows 64bit\forge>SET "JAVA_HOME=C:\Users\*****\Downloads\MCreator 1.7.0 [1.10.2] Windows 64bit\jdk64\"
C:\Users\*****\Downloads\MCreator 1.7.0 [1.10.2] Windows 64bit\forge>SET JAVA_EXE=%JAVA_HOME%\bin\java.exe
C:\Users\*****\Downloads\MCreator 1.7.0 [1.10.2] Windows 64bit\forge>SET PATH=%JAVA_HOME%\bin\;%PATH%
C:\Users\*****\Downloads\MCreator 1.7.0 [1.10.2] Windows 64bit\forge>gradlew -Dorg.gradle.jvmargs="-Xms625m -Xmx2048m" clean build
To honour the JVM settings for this build a new JVM will be forked. Please consider using the daemon: https://docs.gradle.org/2.7/userguide/gradle_daemon.html.
This mapping 'snapshot_20160518' was designed for MC 1.9.4! Use at your own peril.
#################################################
         ForgeGradle 2.2-SNAPSHOT-c438b06        
  https://github.com/MinecraftForge/ForgeGradle  
#################################################
               Powered by MCP unknown               
             http://modcoderpack.com             
         by: Searge, ProfMobius, Fesh0r,         
         R4wk, ZeuX, IngisKahn, bspkrs           
#################################################
:clean
:deobfCompileDummyTask
:deobfProvidedDummyTask
:sourceApiJava
:compileApiJava UP-TO-DATE
:processApiResources UP-TO-DATE
:apiClasses UP-TO-DATE
:sourceMainJava
C:\Users\*****\Downloads\MCreator 1.7.0 [1.10.2] Windows 64bit\forge\build\sources\main\java\mod\mcreator\TestEnvironmentMod.java:39: error: cannot find symbol
    mcreator_friendlyZombie mcreator_0 = new mcreator_friendlyZombie();
    ^
  symbol:   class mcreator_friendlyZombie
  location: class TestEnvironmentMod
C:\Users\*****\Downloads\MCreator 1.7.0 [1.10.2] Windows 64bit\forge\build\sources\main\java\mod\mcreator\TestEnvironmentMod.java:40: error: cannot find symbol
    mcreator_friendlyBiome mcreator_1 = new mcreator_friendlyBiome();
    ^
  symbol:   class mcreator_friendlyBiome
  location: class TestEnvironmentMod
C:\Users\*****\Downloads\MCreator 1.7.0 [1.10.2] Windows 64bit\forge\build\sources\main\java\mod\mcreator\TestEnvironmentMod.java:41: error: cannot find symbol
    mcreator_friendlySkeleton mcreator_2 = new mcreator_friendlySkeleton();
    ^
  symbol:   class mcreator_friendlySkeleton
  location: class TestEnvironmentMod
C:\Users\*****\Downloads\MCreator 1.7.0 [1.10.2] Windows 64bit\forge\build\sources\main\java\mod\mcreator\TestEnvironmentMod.java:42: error: cannot find symbol
    mcreator_friendlyCreeper mcreator_3 = new mcreator_friendlyCreeper();
    ^
  symbol:   class mcreator_friendlyCreeper
  location: class TestEnvironmentMod
C:\Users\*****\Downloads\MCreator 1.7.0 [1.10.2] Windows 64bit\forge\build\sources\main\java\mod\mcreator\TestEnvironmentMod.java:43: error: cannot find symbol
    mcreator_oppositeBlock mcreator_4 = new mcreator_oppositeBlock();
    ^
  symbol:   class mcreator_oppositeBlock
  location: class TestEnvironmentMod
C:\Users\*****\Downloads\MCreator 1.7.0 [1.10.2] Windows 64bit\forge\build\sources\main\java\mod\mcreator\TestEnvironmentMod.java:44: error: cannot find symbol
    mcreator_oppositeDimension mcreator_5 = new mcreator_oppositeDimension();
    ^
  symbol:   class mcreator_oppositeDimension
  location: class TestEnvironmentMod
C:\Users\*****\Downloads\MCreator 1.7.0 [1.10.2] Windows 64bit\forge\build\sources\main\java\mod\mcreator\TestEnvironmentMod.java:45: error: cannot find symbol
    mcreator_evilVillager mcreator_6 = new mcreator_evilVillager();
    ^
  symbol:   class mcreator_evilVillager
  location: class TestEnvironmentMod
C:\Users\*****\Downloads\MCreator 1.7.0 [1.10.2] Windows 64bit\forge\build\sources\main\java\mod\mcreator\TestEnvironmentMod.java:46: error: cannot find symbol
    mcreator_evilBiome mcreator_7 = new mcreator_evilBiome();
    ^
  symbol:   class mcreator_evilBiome
  location: class TestEnvironmentMod
C:\Users\*****\Downloads\MCreator 1.7.0 [1.10.2] Windows 64bit\forge\build\sources\main\java\mod\mcreator\TestEnvironmentMod.java:47: error: cannot find symbol
    mcreator_oppositeCraft mcreator_8 = new mcreator_oppositeCraft();
    ^
  symbol:   class mcreator_oppositeCraft
  location: class TestEnvironmentMod
C:\Users\*****\Downloads\MCreator 1.7.0 [1.10.2] Windows 64bit\forge\build\sources\main\java\mod\mcreator\TestEnvironmentMod.java:48: error: cannot find symbol
    mcreator_friendlySpider mcreator_9 = new mcreator_friendlySpider();
    ^
  symbol:   class mcreator_friendlySpider
  location: class TestEnvironmentMod
C:\Users\*****\Downloads\MCreator 1.7.0 [1.10.2] Windows 64bit\forge\build\sources\main\java\mod\mcreator\TestEnvironmentMod.java:49: error: cannot find symbol
    mcreator_human mcreator_10 = new mcreator_human();
    ^
  symbol:   class mcreator_human
  location: class TestEnvironmentMod
C:\Users\*****\Downloads\MCreator 1.7.0 [1.10.2] Windows 64bit\forge\build\sources\main\java\mod\mcreator\TestEnvironmentMod.java:50: error: cannot find symbol
    mcreator_netherChest mcreator_11 = new mcreator_netherChest();
    ^
  symbol:   class mcreator_netherChest
  location: class TestEnvironmentMod
C:\Users\*****\Downloads\MCreator 1.7.0 [1.10.2] Windows 64bit\forge\build\sources\main\java\mod\mcreator\TestEnvironmentMod.java:51: error: cannot find symbol
    mcreator_h mcreator_12 = new mcreator_h();
    ^
  symbol:   class mcreator_h
  location: class TestEnvironmentMod
C:\Users\*****\Downloads\MCreator 1.7.0 [1.10.2] Windows 64bit\forge\build\sources\main\java\mod\mcreator\TestEnvironmentMod.java:52: error: cannot find symbol
    mcreator_friendlyEndermen mcreator_13 = new mcreator_friendlyEndermen();
    ^
  symbol:   class mcreator_friendlyEndermen
  location: class TestEnvironmentMod
C:\Users\*****\Downloads\MCreator 1.7.0 [1.10.2] Windows 64bit\forge\build\sources\main\java\mod\mcreator\TestEnvironmentMod.java:53: error: cannot find symbol
    mcreator_evilIronGolem mcreator_14 = new mcreator_evilIronGolem();
    ^
  symbol:   class mcreator_evilIronGolem
  location: class TestEnvironmentMod
C:\Users\*****\Downloads\MCreator 1.7.0 [1.10.2] Windows 64bit\forge\build\sources\main\java\mod\mcreator\TestEnvironmentMod.java:54: error: cannot find symbol
    mcreator_evilCow mcreator_15 = new mcreator_evilCow();
    ^
  symbol:   class mcreator_evilCow
  location: class TestEnvironmentMod
C:\Users\*****\Downloads\MCreator 1.7.0 [1.10.2] Windows 64bit\forge\build\sources\main\java\mod\mcreator\TestEnvironmentMod.java:55: error: cannot find symbol
    mcreator_monkeyWABoss mcreator_16 = new mcreator_monkeyWABoss();
    ^
  symbol:   class mcreator_monkeyWABoss
  location: class TestEnvironmentMod
C:\Users\*****\Downloads\MCreator 1.7.0 [1.10.2] Windows 64bit\forge\build\sources\main\java\mod\mcreator\TestEnvironmentMod.java:56: error: cannot find symbol
    mcreator_evilPig mcreator_17 = new mcreator_evilPig();
    ^
  symbol:   class mcreator_evilPig
  location: class TestEnvironmentMod
C:\Users\*****\Downloads\MCreator 1.7.0 [1.10.2] Windows 64bit\forge\build\sources\main\java\mod\mcreator\TestEnvironmentMod.java:57: error: cannot find symbol
    mcreator_evilWolf mcreator_18 = new mcreator_evilWolf();
    ^
  symbol:   class mcreator_evilWolf
  location: class TestEnvironmentMod
C:\Users\*****\Downloads\MCreator 1.7.0 [1.10.2] Windows 64bit\forge\build\sources\main\java\mod\mcreator\TestEnvironmentMod.java:58: error: cannot find symbol
    mcreator_pigman mcreator_19 = new mcreator_pigman();
    ^
  symbol:   class mcreator_pigman
  location: class TestEnvironmentMod
C:\Users\*****\Downloads\MCreator 1.7.0 [1.10.2] Windows 64bit\forge\build\sources\main\java\mod\mcreator\TestEnvironmentMod.java:59: error: cannot find symbol
    mcreator_evilHorse mcreator_20 = new mcreator_evilHorse();
    ^
  symbol:   class mcreator_evilHorse
  location: class TestEnvironmentMod
C:\Users\*****\Downloads\MCreator 1.7.0 [1.10.2] Windows 64bit\forge\build\sources\main\java\mod\mcreator\TestEnvironmentMod.java:60: error: cannot find symbol
    mcreator_evilSheep mcreator_21 = new mcreator_evilSheep();
    ^
  symbol:   class mcreator_evilSheep
  location: class TestEnvironmentMod
C:\Users\*****\Downloads\MCreator 1.7.0 [1.10.2] Windows 64bit\forge\build\sources\main\java\mod\mcreator\TestEnvironmentMod.java:61: error: cannot find symbol
    mcreator_pistol mcreator_22 = new mcreator_pistol();
    ^
  symbol:   class mcreator_pistol
  location: class TestEnvironmentMod
C:\Users\*****\Downloads\MCreator 1.7.0 [1.10.2] Windows 64bit\forge\build\sources\main\java\mod\mcreator\TestEnvironmentMod.java:62: error: cannot find symbol
    mcreator_friendlyGhast mcreator_23 = new mcreator_friendlyGhast();
    ^
  symbol:   class mcreator_friendlyGhast
  location: class TestEnvironmentMod
C:\Users\*****\Downloads\MCreator 1.7.0 [1.10.2] Windows 64bit\forge\build\sources\main\java\mod\mcreator\TestEnvironmentMod.java:39: error: cannot find symbol
    mcreator_friendlyZombie mcreator_0 = new mcreator_friendlyZombie();
                                             ^
  symbol:   class mcreator_friendlyZombie
  location: class TestEnvironmentMod
C:\Users\*****\Downloads\MCreator 1.7.0 [1.10.2] Windows 64bit\forge\build\sources\main\java\mod\mcreator\TestEnvironmentMod.java:40: error: cannot find symbol
    mcreator_friendlyBiome mcreator_1 = new mcreator_friendlyBiome();
                                            ^
  symbol:   class mcreator_friendlyBiome
  location: class TestEnvironmentMod
C:\Users\*****\Downloads\MCreator 1.7.0 [1.10.2] Windows 64bit\forge\build\sources\main\java\mod\mcreator\TestEnvironmentMod.java:41: error: cannot find symbol
    mcreator_friendlySkeleton mcreator_2 = new mcreator_friendlySkeleton();
                                               ^
  symbol:   class mcreator_friendlySkeleton
  location: class TestEnvironmentMod
C:\Users\*****\Downloads\MCreator 1.7.0 [1.10.2] Windows 64bit\forge\build\sources\main\java\mod\mcreator\TestEnvironmentMod.java:42: error: cannot find symbol
    mcreator_friendlyCreeper mcreator_3 = new mcreator_friendlyCreeper();
                                              ^
  symbol:   class mcreator_friendlyCreeper
  location: class TestEnvironmentMod
C:\Users\*****\Downloads\MCreator 1.7.0 [1.10.2] Windows 64bit\forge\build\sources\main\java\mod\mcreator\TestEnvironmentMod.java:43: error: cannot find symbol
    mcreator_oppositeBlock mcreator_4 = new mcreator_oppositeBlock();
                                            ^
  symbol:   class mcreator_oppositeBlock
  location: class TestEnvironmentMod
C:\Users\*****\Downloads\MCreator 1.7.0 [1.10.2] Windows 64bit\forge\build\sources\main\java\mod\mcreator\TestEnvironmentMod.java:44: error: cannot find symbol
    mcreator_oppositeDimension mcreator_5 = new mcreator_oppositeDimension();
                                                ^
  symbol:   class mcreator_oppositeDimension
  location: class TestEnvironmentMod
C:\Users\*****\Downloads\MCreator 1.7.0 [1.10.2] Windows 64bit\forge\build\sources\main\java\mod\mcreator\TestEnvironmentMod.java:45: error: cannot find symbol
    mcreator_evilVillager mcreator_6 = new mcreator_evilVillager();
                                           ^
  symbol:   class mcreator_evilVillager
  location: class TestEnvironmentMod
C:\Users\*****\Downloads\MCreator 1.7.0 [1.10.2] Windows 64bit\forge\build\sources\main\java\mod\mcreator\TestEnvironmentMod.java:46: error: cannot find symbol
    mcreator_evilBiome mcreator_7 = new mcreator_evilBiome();
                                        ^
  symbol:   class mcreator_evilBiome
  location: class TestEnvironmentMod
C:\Users\*****\Downloads\MCreator 1.7.0 [1.10.2] Windows 64bit\forge\build\sources\main\java\mod\mcreator\TestEnvironmentMod.java:47: error: cannot find symbol
    mcreator_oppositeCraft mcreator_8 = new mcreator_oppositeCraft();
                                            ^
  symbol:   class mcreator_oppositeCraft
  location: class TestEnvironmentMod
C:\Users\*****\Downloads\MCreator 1.7.0 [1.10.2] Windows 64bit\forge\build\sources\main\java\mod\mcreator\TestEnvironmentMod.java:48: error: cannot find symbol
    mcreator_friendlySpider mcreator_9 = new mcreator_friendlySpider();
                                             ^
  symbol:   class mcreator_friendlySpider
  location: class TestEnvironmentMod
C:\Users\*****\Downloads\MCreator 1.7.0 [1.10.2] Windows 64bit\forge\build\sources\main\java\mod\mcreator\TestEnvironmentMod.java:49: error: cannot find symbol
    mcreator_human mcreator_10 = new mcreator_human();
                                     ^
  symbol:   class mcreator_human
  location: class TestEnvironmentMod
C:\Users\*****\Downloads\MCreator 1.7.0 [1.10.2] Windows 64bit\forge\build\sources\main\java\mod\mcreator\TestEnvironmentMod.java:50: error: cannot find symbol
    mcreator_netherChest mcreator_11 = new mcreator_netherChest();
                                           ^
  symbol:   class mcreator_netherChest
  location: class TestEnvironmentMod
C:\Users\*****\Downloads\MCreator 1.7.0 [1.10.2] Windows 64bit\forge\build\sources\main\java\mod\mcreator\TestEnvironmentMod.java:51: error: cannot find symbol
    mcreator_h mcreator_12 = new mcreator_h();
                                 ^
  symbol:   class mcreator_h
  location: class TestEnvironmentMod
C:\Users\*****\Downloads\MCreator 1.7.0 [1.10.2] Windows 64bit\forge\build\sources\main\java\mod\mcreator\TestEnvironmentMod.java:52: error: cannot find symbol
    mcreator_friendlyEndermen mcreator_13 = new mcreator_friendlyEndermen();
                                                ^
  symbol:   class mcreator_friendlyEndermen
  location: class TestEnvironmentMod
C:\Users\*****\Downloads\MCreator 1.7.0 [1.10.2] Windows 64bit\forge\build\sources\main\java\mod\mcreator\TestEnvironmentMod.java:53: error: cannot find symbol
    mcreator_evilIronGolem mcreator_14 = new mcreator_evilIronGolem();
                                             ^
  symbol:   class mcreator_evilIronGolem
  location: class TestEnvironmentMod
C:\Users\*****\Downloads\MCreator 1.7.0 [1.10.2] Windows 64bit\forge\build\sources\main\java\mod\mcreator\TestEnvironmentMod.java:54: error: cannot find symbol
    mcreator_evilCow mcreator_15 = new mcreator_evilCow();
                                       ^
  symbol:   class mcreator_evilCow
  location: class TestEnvironmentMod
C:\Users\*****\Downloads\MCreator 1.7.0 [1.10.2] Windows 64bit\forge\build\sources\main\java\mod\mcreator\TestEnvironmentMod.java:55: error: cannot find symbol
    mcreator_monkeyWABoss mcreator_16 = new mcreator_monkeyWABoss();
                                            ^
  symbol:   class mcreator_monkeyWABoss
  location: class TestEnvironmentMod
C:\Users\*****\Downloads\MCreator 1.7.0 [1.10.2] Windows 64bit\forge\build\sources\main\java\mod\mcreator\TestEnvironmentMod.java:56: error: cannot find symbol
    mcreator_evilPig mcreator_17 = new mcreator_evilPig();
                                       ^
  symbol:   class mcreator_evilPig
  location: class TestEnvironmentMod
C:\Users\*****\Downloads\MCreator 1.7.0 [1.10.2] Windows 64bit\forge\build\sources\main\java\mod\mcreator\TestEnvironmentMod.java:57: error: cannot find symbol
    mcreator_evilWolf mcreator_18 = new mcreator_evilWolf();
                                        ^
  symbol:   class mcreator_evilWolf
  location: class TestEnvironmentMod
C:\Users\*****\Downloads\MCreator 1.7.0 [1.10.2] Windows 64bit\forge\build\sources\main\java\mod\mcreator\TestEnvironmentMod.java:58: error: cannot find symbol
    mcreator_pigman mcreator_19 = new mcreator_pigman();
                                      ^
  symbol:   class mcreator_pigman
  location: class TestEnvironmentMod
C:\Users\*****\Downloads\MCreator 1.7.0 [1.10.2] Windows 64bit\forge\build\sources\main\java\mod\mcreator\TestEnvironmentMod.java:59: error: cannot find symbol
    mcreator_evilHorse mcreator_20 = new mcreator_evilHorse();
                                         ^
  symbol:   class mcreator_evilHorse
  location: class TestEnvironmentMod
C:\Users\*****\Downloads\MCreator 1.7.0 [1.10.2] Windows 64bit\forge\build\sources\main\java\mod\mcreator\TestEnvironmentMod.java:60: error: cannot find symbol
    mcreator_evilSheep mcreator_21 = new mcreator_evilSheep();
                                         ^
  symbol:   class mcreator_evilSheep
  location: class TestEnvironmentMod
C:\Users\*****\Downloads\MCreator 1.7.0 [1.10.2] Windows 64bit\forge\build\sources\main\java\mod\mcreator\TestEnvironmentMod.java:61: error: cannot find symbol
    mcreator_pistol mcreator_22 = new mcreator_pistol();
                                      ^
  symbol:   class mcreator_pistol
  location: class TestEnvironmentMod
C:\Users\*****\Downloads\MCreator 1.7.0 [1.10.2] Windows 64bit\forge\build\sources\main\java\mod\mcreator\TestEnvironmentMod.java:62: error: cannot find symbol
    mcreator_friendlyGhast mcreator_23 = new mcreator_friendlyGhast();
                                             ^
  symbol:   class mcreator_friendlyGhast
  location: class TestEnvironmentMod
C:\Users\*****\Downloads\MCreator 1.7.0 [1.10.2] Windows 64bit\forge\build\sources\main\java\mod\mcreator\mcreator_evilIronGolem.java:58: error: cannot find symbol
        RenderLiving customRender = new RenderLiving(Minecraft.getMinecraft().getRenderManager(), new mcreator_evilIronGolem.Model(), 0) {
                                                                                                                            ^
  symbol:   class Model
  location: class mcreator_evilIronGolem
49 errors
:compileJava FAILED
FAILURE: Build failed with an exception.
* What went wrong:
Execution failed for task ':compileJava'.
> Compilation failed; see the compiler error output for details.
* Try:
Run with --stacktrace option to get the stack trace. Run with --info or --debug option to get more log output.
BUILD FAILED
Total time: 27.981 secs
C:\Users\******\Downloads\MCreator 1.7.0 [1.10.2] Windows 64bit\forge>
Task completed with return code 0 in 28708 milliseconds

 

Can you help me?

Thank you.

 

Edited by Klemen on Sun, 10/30/2016 - 16:53
Last seen on 16:42, 18. Aug 2019
Joined Apr 2010
User points:

Statistics:

  • Comments:
  • Forum topics:
  • Modifications:
  • Wiki pages:
  • wiki contributor
  • moderator
  • developer
Try pressing build button on
Sun, 10/30/2016 - 16:54

Try pressing build button on top of the screen a few times. This might solve this bug. In some cases, this might be caused by a bug that will be fixed in MCreator 1.7.1.