COMPILE JAVA?

Started by Jake2_0 on Tue, 12/06/2016 - 23:15

Topic category: Help with MCreator's application

Last seen on 20:42, 9. Dec 2016
Joined Apr 2016
User points:

Statistics:

  • Comments:
  • Forum topics:
  • Modifications:
  • Wiki pages:
COMPILE JAVA?
Tue, 12/06/2016 - 23:15

Hi it's me, and whenever I create my SECOND element, it never goes in the code. Subscribe to TheSlimeCommando on youtube for fun gaming, tutorials, and MCreator!(If i can get it to work) Here is what is says:

   
Executing gradle command: clean build
Microsoft Windows [Version 10.0.14393]
(c) 2016 Microsoft Corporation. All rights reserved.
C:\Pylo\MCreator170>cd forge
C:\Pylo\MCreator170\forge>SET "JAVA_HOME=C:\Pylo\MCreator170\jdk64\"
C:\Pylo\MCreator170\forge>SET JAVA_EXE=%JAVA_HOME%\bin\java.exe
C:\Pylo\MCreator170\forge>SET PATH=%JAVA_HOME%\bin\;%PATH%
C:\Pylo\MCreator170\forge>gradlew -Dorg.gradle.jvmargs="-Xms625m -Xmx4991m" clean build
To honour the JVM settings for this build a new JVM will be forked. Please consider using the daemon: https://docs.gradle.org/2.7/userguide/gradle_daemon.html.
This mapping 'snapshot_20160518' was designed for MC 1.9.4! Use at your own peril.
#################################################
         ForgeGradle 2.2-SNAPSHOT-c438b06        
  https://github.com/MinecraftForge/ForgeGradle  
#################################################
               Powered by MCP unknown               
             http://modcoderpack.com             
         by: Searge, ProfMobius, Fesh0r,         
         R4wk, ZeuX, IngisKahn, bspkrs           
#################################################
:clean
:deobfCompileDummyTask
:getVersionJson
:extractUserdev UP-TO-DATE
:downloadClient SKIPPED
:downloadServer SKIPPED
:splitServerJar SKIPPED
:mergeJars SKIPPED
:applyBinaryPatches SKIPPED
:deobfProvidedDummyTask
:extractDependencyATs SKIPPED
:extractMcpData SKIPPED
:extractMcpMappings SKIPPED
:genSrgs SKIPPED
:deobfMcMCP SKIPPED
:sourceApiJava
:compileApiJava UP-TO-DATE
:processApiResources UP-TO-DATE
:apiClasses UP-TO-DATE
:sourceMainJava
C:\Pylo\MCreator170\forge\build\sources\main\java\mod\mcreator\TestEnvironmentMod.java:40: error: cannot find symbol
    mcreator_wings mcreator_1 = new mcreator_wings();
    ^
  symbol:   class mcreator_wings
  location: class TestEnvironmentMod
C:\Pylo\MCreator170\forge\build\sources\main\java\mod\mcreator\TestEnvironmentMod.java:40: error: cannot find symbol
    mcreator_wings mcreator_1 = new mcreator_wings();
                                    ^
  symbol:   class mcreator_wings
  location: class TestEnvironmentMod
2 errors
:compileJava FAILED
FAILURE: Build failed with an exception.
* What went wrong:
Execution failed for task ':compileJava'.
> Compilation failed; see the compiler error output for details.
* Try:
Run with --stacktrace option to get the stack trace. Run with --info or --debug option to get more log output.
BUILD FAILED
Total time: 45.397 secs
C:\Pylo\MCreator170\forge>
Task completed with return code 0 in 48789 milliseconds

Last seen on 18:08, 14. Jul 2017
Joined Dec 2016
User points:

Statistics:

  • Comments:
  • Forum topics:
  • Modifications:
  • Wiki pages:
Just update to 1.7.1 and it
Fri, 12/09/2016 - 21:29

Just update to 1.7.1 and it will work. That happened to me.