Gradle error log problem

Started by shahar99 on Sun, 01/08/2017 - 18:34

Topic category: Help with MCreator's application

Last seen on 21:25, 28. Oct 2017
Joined Jan 2016
User points:

Statistics:

  • Comments:
  • Forum topics:
  • Modifications:
  • Wiki pages:
Gradle error log problem
Sun, 01/08/2017 - 18:34

Every time I create something new Bmhmhic Hmcmch sends this message to me and I dont know what to do to fix it.

I hope you will help me.

thanks

Last seen on 21:25, 28. Oct 2017
Joined Jan 2016
User points:

Statistics:

  • Comments:
  • Forum topics:
  • Modifications:
  • Wiki pages:
 This image is better.
Sun, 01/08/2017 - 18:35

 This image is better.

Last seen on 21:25, 28. Oct 2017
Joined Jan 2016
User points:

Statistics:

  • Comments:
  • Forum topics:
  • Modifications:
  • Wiki pages:
That is it:  
Sun, 01/08/2017 - 18:39

That is it:  

           

warning: [options] bootstrap class path not set in conjunction with -source 1.6
C:\Pylo\MCreator174\forge\build\sources\main\java\mod\mcreator\ModName.java:82: error: cannot find symbol
    mcreator_soulsSword mcreator_43 = new mcreator_soulsSword();
    ^
  symbol:   class mcreator_soulsSword
  location: class ModName
C:\Pylo\MCreator174\forge\build\sources\main\java\mod\mcreator\ModName.java:82: error: cannot find symbol
    mcreator_soulsSword mcreator_43 = new mcreator_soulsSword();
                                          ^
  symbol:   class mcreator_soulsSword
  location: class ModName
Note: Some input files use or override a deprecated API.
Note: Recompile with -Xlint:deprecation for details.
Note: Some input files use unchecked or unsafe operations.
Note: Recompile with -Xlint:unchecked for details.
2 errors
1 warning

FAILURE: Build failed with an exception.

* What went wrong:
Execution failed for task ':compileJava'.
> Compilation failed; see the compiler error output for details.

* Try:
Run with --stacktrace option to get the stack trace. Run with --info or --debug option to get more log output.