Error when trying to build my mod

Started by DanTDMkill on Sat, 10/07/2017 - 23:48

Topic category: Bugs and solutions

Last seen on 23:56, 9. Aug 2018
Joined Sep 2017
User points:

Statistics:

  • Comments:
  • Forum topics:
  • Modifications:
  • Wiki pages:
Error when trying to build my mod
Sat, 10/07/2017 - 23:48

I am on MCreator V1.6.0 (I think)

Microsoft Windows [Version 6.1.7601]
Copyright (c) 2009 Microsoft Corporation.  All rights reserved.
C:\Pylo\MCreator160>cd forge
C:\Pylo\MCreator160\forge>SET "JAVA_HOME=C:\Pylo\MCreator160\jdk\"
C:\Pylo\MCreator160\forge>SET JAVA_EXE=%JAVA_HOME%\bin\java.exe
C:\Pylo\MCreator160\forge>SET PATH=%JAVA_HOME%\bin\;%PATH%
C:\Pylo\MCreator160\forge>SET "JAVA_OPTS=-Xmx256m -Xms200m"
C:\Pylo\MCreator160\forge>gradlew clean runClient
****************************
 Powered By MCP:             
 http://modcoderpack.com/    
 Searge, ProfMobius, Fesh0r, 
 R4wk, ZeuX, IngisKahn, bspkrs
 MCP Data version : snapshot_20141130
****************************
:clean
:downloadClient SKIPPED
:downloadServer SKIPPED
:getVersionJson
:extractUserDev UP-TO-DATE
:mergeJars SKIPPED
:applyBinPatches SKIPPED
:downloadMcpTools SKIPPED
:extractMcpData UP-TO-DATE
:genSrgs SKIPPED
:deobfBinJar SKIPPED
:compileApiJava UP-TO-DATE
:processApiResources UP-TO-DATE
:apiClasses UP-TO-DATE
:sourceMainJava
C:\Pylo\MCreator160\forge\build\sources\java\mod\mcreator\mcreator_fakeOre.java:254: error: cannot find symbol
setBlockBounds(1.0F,1.0F,1.0F,1.0F,1.0F,1.0F);
^
  symbol:   method setBlockBounds(float,float,float,float,float,float)
  location: class EntityfakeOre
1 error
:compileJava FAILED
FAILURE: Build failed with an exception.
* What went wrong:
Execution failed for task ':compileJava'.
> Compilation failed; see the compiler error output for details.
BUILD FAILED
* Try:
Run with --stacktrace option to get the stack trace. Run with --info or --debug option to get more log output.
Total time: 1 mins 1.288 secs
C:\Pylo\MCreator160\forge>
Task completed with return code 0 in 66320 milliseconds