Cant create new project Workspace setup failed

Started by RunkPunk432 on

Topic category: Help with MCreator software

Last seen on 01:03, 7. Jul 2024
Joined Jun 2024
Points:

User statistics:

  • Modifications:
  • Forum topics:
  • Wiki pages:
  • MCreator plugins:
  • Comments:
Cant create new project Workspace setup failed

I just download the newest version and every time i try to make a new project i get this error and I've tried deleting my cache, reinstalling , installing the zip, trying different versions and all the solutions on https://mcreator.net/wiki/gradle-setup-errors

 

Executing Gradle task: idePostSync
Build info: MCreator 2024.1.18518, neoforge-1.20.4, 64-bit, 12153 MB, Windows 11, JVM 17.0.10, JAVA_HOME: D:\Downloads\MCreator.2024.1.Windows.64bit\MCreator20241\jdk, started on: 2024-06-24-22:51:00

FAILURE: Build failed with an exception.
* What went wrong:
A problem occurred configuring root project 'test'.
> A build operation failed.
Could not move temporary workspace (C:\Users\user\.mcreator\gradle\caches\transforms-4\743e05f954ad78bd12799f3694e27b9e-915535af-6efc-4695-8d27-54b85f3e29b7) to immutable location (C:\Users\ninja\.mcreator\gradle\caches\transforms-4\743e05f954ad78bd12799f3694e27b9e)
> Could not move temporary workspace (C:\Users\user\.mcreator\gradle\caches\transforms-4\743e05f954ad78bd12799f3694e27b9e-915535af-6efc-4695-8d27-54b85f3e29b7) to immutable location (C:\Users\ninja\.mcreator\gradle\caches\transforms-4\743e05f954ad78bd12799f3694e27b9e)
* Try:
> Run with --stacktrace option to get the stack trace.
> Run with --info or --debug option to get more log output.
> Run with --scan to get full insights.
> Get more help at https://help.gradle.org.
BUILD FAILED in 8s

BUILD FAILED
Task completed in 9 seconds

 

Last seen on 01:03, 7. Jul 2024
Joined Jun 2024
Points:

User statistics:

  • Modifications:
  • Forum topics:
  • Wiki pages:
  • MCreator plugins:
  • Comments:
Something like a firewall or…
Fri, 06/28/2024 - 22:11

Something like a firewall or antivirus?