Mcreator nether poblem

Started by BananaCreeperBR on Sat, 05/20/2017 - 00:26
Last seen on 22:02, 26. May 2017
Joined Dec 2015
User points:

Statistics:

  • Comments:
  • Forum topics:
  • Modifications:
  • Wiki pages:
Mcreator nether poblem
Sat, 05/20/2017 - 00:26

error: cannot find symbol
        this.netherCaveGenerator.generate(this, this.worldObj, x, z, chunkprimer);
                                ^
  symbol:   method generate(ChunkProviderModded,World,int,int,ChunkPrimer)
  location: variable netherCaveGenerator of type MapGenBase
1 error
:compileJava FAILED
FAILURE: Build failed with an exception.
* What went wrong:
Execution faiTotal time: 12.348 secs
led for task ':compileJava'.
BUILD FAILED
> Compilation failed; see the compiler error outRun with --stacktrace option to get the stack trace. Run with --info or --debug option to get more log output.
put for details.

 

pls help

 

Last seen on 06:17, 12. Nov 2017
Joined Mar 2015
User points:

Statistics:

  • Comments:
  • Forum topics:
  • Modifications:
  • Wiki pages:
  • moderator
try recreating the element,
Fri, 05/26/2017 - 07:57

try recreating the element, if that dont work check the textures for blocks because sometimes they bug out and need to be refreshed

Last seen on 17:22, 6. Nov 2017
Joined May 2017
User points:

Statistics:

  • Comments:
  • Forum topics:
  • Modifications:
  • Wiki pages:
my ores won't spawn in the
Fri, 05/26/2017 - 08:45

my ores won't spawn in the nether