I can't compile or export

Started by AngelFireLA on Tue, 05/12/2020 - 12:23

Topic category: Help with modding (Java Edition)

Last seen on 12:13, 12. Jun 2021
Joined Sep 2018
Points:

User statistics:

  • Modifications:
  • Forum topics:
  • Wiki pages:
  • Tracker tickets:
  • MCreator plugins:
  • Comments:
I can't compile or export
Tue, 05/12/2020 - 12:23

I have an eroor with the mcreator version for minecraft 1.9.4, I try to click on next for all mod parts and I tried to delete the .gradle forlder in the /mcreator folder

 

javax.net.ssl.SSLHandshakeException: sun.security.validator.ValidatorException: PKIX path building failed: sun.security.provider.certpath.SunCertPathBuilderException: unable to find valid certification path to requested target
    at sun.security.ssl.Alerts.getSSLException(Alerts.java:192)
    at sun.security.ssl.SSLSocketImpl.fatal(SSLSocketImpl.java:1949)
    at sun.security.ssl.Handshaker.fatalSE(Handshaker.java:302)
    at sun.security.ssl.Handshaker.fatalSE(Handshaker.java:296)
    at sun.security.ssl.ClientHandshaker.serverCertificate(ClientHandshaker.java:1509)
    at sun.security.ssl.ClientHandshaker.processMessage(ClientHandshaker.java:216)
    at sun.security.ssl.Handshaker.processLoop(Handshaker.java:979)
    at sun.security.ssl.Handshaker.process_record(Handshaker.java:914)
    at sun.security.ssl.SSLSocketImpl.readRecord(SSLSocketImpl.java:1062)
    at sun.security.ssl.SSLSocketImpl.performInitialHandshake(SSLSocketImpl.java:1375)
    at sun.security.ssl.SSLSocketImpl.startHandshake(SSLSocketImpl.java:1403)
    at sun.security.ssl.SSLSocketImpl.startHandshake(SSLSocketImpl.java:1387)
    at sun.net.www.protocol.https.HttpsClient.afterConnect(HttpsClient.java:559)
    at sun.net.www.protocol.https.AbstractDelegateHttpsURLConnection.connect(AbstractD…
    at sun.net.www.protocol.https.HttpsURLConnectionImpl.connect(HttpsURLConnectionImp…
    at net.minecraftforge.gradle.common.BasePlugin.getWithEtag(BasePlugin.java:718)
    at net.minecraftforge.gradle.common.BasePlugin.getRemoteJsons(BasePlugin.java:221)
    at net.minecraftforge.gradle.common.BasePlugin.apply(BasePlugin.java:177)
    at net.minecraftforge.gradle.common.BasePlugin.apply(BasePlugin.java:92)
    at org.gradle.api.internal.plugins.ImperativeOnlyPluginApplicator.applyImperative(ImperativeOnlyPluginApplicator.java:35)
    at org.gradle.api.internal.plugins.RuleBasedPluginApplicator.applyImperative(RuleBasedPluginApplicator.java:43)
    at org.gradle.api.internal.plugins.DefaultPluginManager.doApply(DefaultPluginManager.java:144)
    at org.gradle.api.internal.plugins.DefaultPluginManager.apply(DefaultPluginManager.java:112)
    at org.gradle.api.internal.plugins.DefaultObjectConfigurationAction.applyType(DefaultObjectConfigurationAction.java:112)
    at org.gradle.api.internal.plugins.DefaultObjectConfigurationAction.access$200(DefaultObjectConfigurationAction.java:35)
    at org.gradle.api.internal.plugins.DefaultObjectConfigurationAction$3.run(DefaultObjectConfigurationAction.java:79)
    at org.gradle.api.internal.plugins.DefaultObjectConfigurationAction.execute(DefaultObjectConfigurationAction.java:135)
    at org.gradle.api.internal.project.AbstractPluginAware.apply(AbstractPluginAware.java:46)
    at org.gradle.api.plugins.PluginAware$apply.call(Unknown Source)
    at org.codehaus.groovy.runtime.callsite.CallSiteArray.defaultCall(CallSiteArray.java:45)
    at org.codehaus.groovy.runtime.callsite.AbstractCallSite.call(AbstractCallSite.java:108)
    at org.codehaus.groovy.runtime.callsite.AbstractCallSite.call(AbstractCallSite.java:116)
    at org.gradle.api.internal.project.ProjectScript.apply(ProjectScript.groovy:34)
    at org.gradle.api.Script$apply$0.callCurrent(Unknown Source)
    at org.codehaus.groovy.runtime.callsite.CallSiteArray.defaultCallCurrent(CallSiteArray.java:49)
    at org.codehaus.groovy.runtime.callsite.AbstractCallSite.callCurrent(AbstractCallSite.java:133)
    at org.codehaus.groovy.runtime.callsite.AbstractCallSite.callCurrent(AbstractCallSite.java:141)
    at build_tycj9h8o2r0b98834n0ik8c7.run(C:\Users\eleve\Downloads\MCreator1.6.9 [1.9.4] Windows32bit\forge\build.gradle:15)
    at org.gradle.groovy.scripts.internal.DefaultScriptRunnerFactory$ScriptRunnerImpl.run(DefaultScriptRunnerFactory.java:91)
    at org.gradle.configuration.DefaultScriptPluginFactory$ScriptPluginImpl$1.run(DefaultScriptPluginFactory.java:148)
    at org.gradle.configuration.ProjectScriptTarget.addConfiguration(ProjectScriptTarget.java:72)
    at org.gradle.configuration.DefaultScriptPluginFactory$ScriptPluginImpl.apply(DefaultScriptPluginFactory.java:153)
    at org.gradle.configuration.project.BuildScriptProcessor.execute(BuildScriptProcessor.java:38)
    at org.gradle.configuration.project.BuildScriptProcessor.execute(BuildScriptProcessor.java:25)
    at org.gradle.configuration.project.ConfigureActionsProjectEvaluator.evaluate(ConfigureActionsProjectEvaluator.java:34)
    at org.gradle.configuration.project.LifecycleProjectEvaluator.evaluate(LifecycleProjectEvaluator.java:55)
    at org.gradle.api.internal.project.AbstractProject.evaluate(AbstractProject.java:491)
    at org.gradle.api.internal.project.AbstractProject.evaluate(AbstractProject.java:89)
    at org.gradle.execution.TaskPathProjectEvaluator.configureHierarchy(TaskPathProjectEvaluator.java:42)
    at org.gradle.configuration.DefaultBuildConfigurer.configure(DefaultBuildConfigurer.java:35)
    at org.gradle.initialization.DefaultGradleLauncher$2.run(DefaultGradleLauncher.java:126)
    at org.gradle.internal.Factories$1.create(Factories.java:22)
    at org.gradle.internal.progress.DefaultBuildOperationExecutor.run(DefaultBuildOperationExecutor.java:90)
    at org.gradle.internal.progress.DefaultBuildOperationExecutor.run(DefaultBuildOperationExecutor.java:52)
    at org.gradle.initialization.DefaultGradleLauncher.doBuildStages(DefaultGradleLauncher.java:123)
    at org.gradle.initialization.DefaultGradleLauncher.access$200(DefaultGradleLauncher.java:33)
    at org.gradle.initialization.DefaultGradleLauncher$1.create(DefaultGradleLauncher.java:100)
    at org.gradle.initialization.DefaultGradleLauncher$1.create(DefaultGradleLauncher.java:94)
    at org.gradle.internal.progress.DefaultBuildOperationExecutor.run(DefaultBuildOperationExecutor.java:90)
    at org.gradle.internal.progress.DefaultBuildOperationExecutor.run(DefaultBuildOperationExecutor.java:62)
    at org.gradle.initialization.DefaultGradleLauncher.doBuild(DefaultGradleLauncher.java:94)
    at org.gradle.initialization.DefaultGradleLauncher.run(DefaultGradleLauncher.java:83)
    at org.gradle.launcher.exec.InProcessBuildActionExecuter$DefaultBuildController.run(InProcessBuildActionExecuter.java:94)
    at org.gradle.tooling.internal.provider.ExecuteBuildActionRunner.run(ExecuteBuildActionRunner.java:28)
    at org.gradle.launcher.exec.ChainingBuildActionRunner.run(ChainingBuildActionRunner.java:35)
    at org.gradle.launcher.exec.InProcessBuildActionExecuter.execute(InProcessBuildActionExecuter.java:43)
    at org.gradle.launcher.exec.InProcessBuildActionExecuter.execute(InProcessBuildActionExecuter.java:28)
    at org.gradle.launcher.exec.ContinuousBuildActionExecuter.execute(ContinuousBuildActionExecuter.java:77)
    at org.gradle.launcher.exec.ContinuousBuildActionExecuter.execute(ContinuousBuildActionExecuter.java:47)
    at org.gradle.launcher.exec.DaemonUsageSuggestingBuildActionExecuter.execute(DaemonUsageSuggestingBuildActionExecuter.java:51)
    at org.gradle.launcher.exec.DaemonUsageSuggestingBuildActionExecuter.execute(DaemonUsageSuggestingBuildActionExecuter.java:28)
    at org.gradle.launcher.cli.RunBuildAction.run(RunBuildAction.java:43)
    at org.gradle.internal.Actions$RunnableActionAdapter.execute(Actions.java:170)
    at org.gradle.launcher.cli.CommandLineActionFactory$ParseAndBuildAction.execute(CommandLineActionFactory.java:237)
    at org.gradle.launcher.cli.CommandLineActionFactory$ParseAndBuildAction.execute(CommandLineActionFactory.java:210)
    at org.gradle.launcher.cli.JavaRuntimeValidationAction.execute(JavaRuntimeValidationAction.java:35)
    at org.gradle.launcher.cli.JavaRuntimeValidationAction.execute(JavaRuntimeValidationAction.java:24)
    at org.gradle.launcher.cli.CommandLineActionFactory$WithLogging.execute(CommandLineActionFactory.java:206)
    at org.gradle.launcher.cli.CommandLineActionFactory$WithLogging.execute(CommandLineActionFactory.java:169)
    at org.gradle.launcher.cli.ExceptionReportingAction.execute(ExceptionReportingAction.java:33)
    at org.gradle.launcher.cli.ExceptionReportingAction.execute(ExceptionReportingAction.java:22)
    at org.gradle.launcher.Main.doAction(Main.java:33)
    at org.gradle.launcher.bootstrap.EntryPoint.run(EntryPoint.java:45)
    at sun.reflect.NativeMethodAccessorImpl.invoke0(Native Method)
    at sun.reflect.NativeMethodAccessorImpl.invoke(NativeMethodAccessorImpl.java:62)
    at sun.reflect.DelegatingMethodAccessorImpl.invoke(DelegatingMethodAccessorImpl.java:43)
    at java.lang.reflect.Method.invoke(Method.java:497)
    at org.gradle.launcher.bootstrap.ProcessBootstrap.runNoExit(ProcessBootstrap.java:54)
    at org.gradle.launcher.bootstrap.ProcessBootstrap.run(ProcessBootstrap.java:35)
    at org.gradle.launcher.GradleMain.main(GradleMain.java:23)
    at sun.reflect.NativeMethodAccessorImpl.invoke0(Native Method)
    at sun.reflect.NativeMethodAccessorImpl.invoke(NativeMethodAccessorImpl.java:62)
    at sun.reflect.DelegatingMethodAccessorImpl.invoke(DelegatingMethodAccessorImpl.java:43)
    at java.lang.reflect.Method.invoke(Method.java:497)
    at org.gradle.wrapper.BootstrapMainStarter.start(BootstrapMainStarter.java:30)
    at org.gradle.wrapper.WrapperExecutor.execute(WrapperExecutor.java:127)
    at org.gradle.wrapper.GradleWrapperMain.main(GradleWrapperMain.java:61)
Caused by: sun.security.validator.ValidatorException: PKIX path building failed: sun.security.provider.certpath.SunCertPathBuilderException: unable to find valid certification path to requested target
    at sun.security.validator.PKIXValidator.doBuild(PKIXValidator.java:387)
    at sun.security.validator.PKIXValidator.engineValidate(PKIXValidator.java:292)
    at sun.security.validator.Validator.validate(Validator.java:260)
    at sun.security.ssl.X509TrustManagerImpl.validate(X509TrustManagerImpl.java:324)
    at sun.security.ssl.X509TrustManagerImpl.checkTrusted(X509TrustManagerImpl.java:229)
    at sun.security.ssl.X509TrustManagerImpl.checkServerTrusted(X509TrustManagerImpl.java:124)
    at sun.security.ssl.ClientHandshaker.serverCertificate(ClientHandshaker.java:1491)
    ... 92 more
Caused by: sun.security.provider.certpath.SunCertPathBuilderException: unable to find valid certification path to requested target
    at sun.security.provider.certpath.SunCertPathBuilder.build(SunCertPathBuilder.java:146)
    at sun.security.provider.certpath.SunCertPathBuilder.engineBuild(SunCertPathBuilder.java:131)
    at java.security.cert.CertPathBuilder.build(CertPathBuilder.java:280)
    at sun.security.validator.PKIXValidator.doBuild(PKIXValidator.java:382)
    ... 98 more
#################################################
         ForgeGradle 2.2-SNAPSHOT-3966cea        
  https://github.com/MinecraftForge/ForgeGradle  
#################################################
               Powered by MCP unknown               
             http://modcoderpack.com             
         by: Searge, ProfMobius, Fesh0r,         
         R4wk, ZeuX, IngisKahn, bspkrs           
#################################################
:clean UP-TO-DATE
:deobfCompileDummyTask
:getVersionJson
FAILURE: Build failed with an exception.
* What went wrong:
Could not resolve all dependencies for configuration ':forgeGradleUserDevPackage'.
:extractUserdev
> Could not resolve net.minecraftforge:forge:1.9.  Required by:
4-12.17.0.1976.
BUILD FAILED
Total time: 49.912 secs
      com.yourname.modid:forge:1.0
   > Could not resolve net.minecraftforge:forge:1.9.4-12.17.0.1976.
      > Could not get resource 'https://files.minecraftforge.net/maven/net/minecraftforge/forge/1.9.4-1…'.
         > Could not GET 'https://files.minecraftforge.net/maven/net/minecraftforge/forge/1.9.4-1…'.
            > peer not authenticated
* Try:
Run with --stacktrace option to get the stack trace. Run with --info or --debug option to get more log output.
C:\Users\eleve\Downloads\MCreator1.6.9 [1.9.4] Windows32bit\forge>
Task completed with return code 0 in 52652 milliseconds
 

Last seen on 12:13, 12. Jun 2021
Joined Sep 2018
Points:

User statistics:

  • Modifications:
  • Forum topics:
  • Wiki pages:
  • Tracker tickets:
  • MCreator plugins:
  • Comments:
It would be nice to remake…
Wed, 05/13/2020 - 07:04

It would be nice to remake mcreator for older minecraft

Last seen on 09:49, 14. Nov 2020
Joined Nov 2020
Points:

User statistics:

  • Modifications:
  • Forum topics:
  • Wiki pages:
  • Tracker tickets:
  • MCreator plugins:
  • Comments:
so we can't do mod for 1.9.4…
Thu, 11/12/2020 - 20:21

so we can't do mod for 1.9.4 anymore?