Dimension crash during gradle after clearing cache

Started by obeeblue on Sat, 08/01/2020 - 00:32

Topic category: Help with modding (Java Edition)

Last seen on 18:39, 18. Oct 2020
Joined Jul 2020
Points:

User statistics:

  • Modifications:
  • Forum topics:
  • Wiki pages:
  • Tracker tickets:
  • MCreator plugins:
  • Comments:
Dimension crash during gradle after clearing cache
Sat, 08/01/2020 - 00:32

Executing 
    Gradle task: build

Build 
    info: MCreator 2020.3.22116, forge-1.15.2, 64-bit, 24494 MB, Windows 10, 
    JVM 1.8.0_252, JAVA_HOME: C:\Program Files\Pylo\MCreator\jdk


    Configure project :

New 
    Dep: net.minecraftforge:forge:1.15.2-31.2.0_mapped_snapshot_20200514-1.15.1


    Task :compileJava FAILED

C:\Users\obeeb\MCreatorWorkspaces\cursed\src\main\java\net\mcreator\cursed\world\dimension\CoalDimensionDimension.java:226: 
    error: '{' expected 
 
      public static class Size /* failed to load code for 
    net.minecraft.block.NetherPortalBlock */

 
                              ^

C:\Users\obeeb\MCreatorWorkspaces\cursed\src\main\java\net\mcreator\cursed\world\dimension\CoalDimensionDimension.java:257: 
    error: illegal start of type 
}

^

C:\Users\obeeb\MCreatorWorkspaces\cursed\src\main\java\net\mcreator\cursed\world\dimension\CoalDimensionDimension.java:257: 
    error: ';' expected 
}

 
    ^

C:\Users\obeeb\MCreatorWorkspaces\cursed\src\main\java\net\mcreator\cursed\world\dimension\CoalDimensionDimension.java:313: 
    error: illegal start of type 
 
      }

 
      ^

C:\Users\obeeb\MCreatorWorkspaces\cursed\src\main\java\net\mcreator\cursed\world\dimension\CoalDimensionDimension.java:313: 
    error: ';' expected 
 
      }

 
       ^

C:\Users\obeeb\MCreatorWorkspaces\cursed\src\main\java\net\mcreator\cursed\world\dimension\CoalDimensionDimension.java:380: 
    error: reached end of file while parsing 
}

 
    ^

C:\Users\obeeb\MCreatorWorkspaces\cursed\src\main\java\net\mcreator\cursed\world\dimension\CoalDimensionDimension.java:381: 
    error: reached end of file while parsing 

    errors

FAILURE: 
    Build failed with an exception.


    What went wrong:

Execution 
    failed for task ':compileJava'.


    Compilation failed; see the compiler error output for details.


    Try:

Run 
    with --stacktrace option to get the stack trace. Run with --info or 
    --debug option to get more log output. Run with --scan to get full 
    insights.


    Get more help at https://help.gradle.org

Deprecated 
    Gradle features were used in this build, making it incompatible with 
    Gradle 5.0.

Use 
    '--warning-mode all' to show the individual deprecation warnings.

See 
    https://docs.gradle.org/4.10.3/userguide/command_line_interface.html#se…

BUILD 
    FAILED in 1s


    actionable task: 1 executed

BUILD 
    FAILED

Task 
    completed in 3979 milliseconds

https://mcreator.net/support…
Thu, 08/20/2020 - 13:30

https://mcreator.net/support/knowledgebase: -> 

Gradle setup and build errors ->

https://mcreator.net/wiki/gradle-setup-errors:

In some cases, Gradle caches that make sure the build process does not take too long can get corrupted. In such a case, go to:

<your user home folder>/.mcreator/gradle

In this folder, there is a folder called caches. Delete this folder and open MCreator again. Next build will take a bit longer as caches need to be rebuilt. If you can not delete all files in this folder (which is necessary), reboot the computer first to remove any potential file locks.

If this is not enough to make things work, delete the entire gradle folder, not just caches, and try again.

If even this fails, try to delete the entire <your user home folder>/.mcreator/gradle folder, create a new workspace with the same generator version as the version of the workspace failing, after the setup of this new workspace is done, open your current workspace, and click Build & run -> Build workspace, then Build & run -> Reload gradle project and then Build & run -> Regenerate code and build.