Error compile Entity

Started by Mephistophel__ on Sat, 12/19/2020 - 16:30

Topic category: Help with modding (Java Edition)

Last seen on 12:31, 20. Sep 2021
Joined Dec 2020
Points:

User statistics:

  • Modifications:
  • Forum topics:
  • Wiki pages:
  • Tracker tickets:
  • MCreator plugins:
  • Comments:
Error compile Entity
Sat, 12/19/2020 - 16:30

Help, please, i don't understand, in what's problem 

Executing Gradle task: build
Build info: MCreator 2020.4.32115, forge-1.12.2, 64-bit, 3912 MB, Windows 7, JVM 1.8.0_252, JAVA_HOME: C:\Users\Admin\AppData\Roaming\.minecraft\MCreator\jdk
This mapping 'snapshot_20171003' was designed for MC 1.12! Use at your own peril.
:deobfCompileDummyTask
:deobfProvidedDummyTask
:sourceApiJava UP-TO-DATE
:compileApiJava NO-SOURCE
:processApiResources NO-SOURCE
:apiClasses UP-TO-DATE
:sourceMainJava
C:\Users\Admin\MCreatorWorkspaces\domodforyourself\build\sources\main\java\net\mcreator\domodforyourself\entity\EntityVoidWarrior.java:157: error: repeated modifier private final private final private final ModelRenderer bone;
^
C:\Users\Admin\MCreatorWorkspaces\domodforyourself\build\sources\main\java\net\mcreator\domodforyourself\entity\EntityVoidWarrior.java:157: error: repeated modifier private final private final private final ModelRenderer bone;
^
C:\Users\Admin\MCreatorWorkspaces\domodforyourself\build\sources\main\java\net\mcreator\domodforyourself\entity\EntityVoidWarrior.java:157: error: repeated modifier private final private final private final ModelRenderer bone;
^
C:\Users\Admin\MCreatorWorkspaces\domodforyourself\build\sources\main\java\net\mcreator\domodforyourself\entity\EntityVoidWarrior.java:157: error: repeated modifier private final private final private final ModelRenderer bone;
^
C:\Users\Admin\MCreatorWorkspaces\domodforyourself\build\sources\main\java\net\mcreator\domodforyourself\entity\EntityVoidWarrior.java:158: error: repeated modifier private final private final ModelRenderer bone6;
^
C:\Users\Admin\MCreatorWorkspaces\domodforyourself\build\sources\main\java\net\mcreator\domodforyourself\entity\EntityVoidWarrior.java:158: error: repeated modifier private final private final ModelRenderer bone6;
^
C:\Users\Admin\MCreatorWorkspaces\domodforyourself\build\sources\main\java\net\mcreator\domodforyourself\entity\EntityVoidWarrior.java:183: error: illegal start of expression = new ModelRenderer(this);
^
C:\Users\Admin\MCreatorWorkspaces\domodforyourself\build\sources\main\java\net\mcreator\domodforyourself\entity\EntityVoidWarrior.java:184: error: illegal start of expression .setRotationPoint(0.0F, 18.2321F, -0.0286F);
^
C:\Users\Admin\MCreatorWorkspaces\domodforyourself\build\sources\main\java\net\mcreator\domodforyourself\entity\EntityVoidWarrior.java:186: error: illegal start of expression setRotationAngle(, -0.1745F, 0.0F, 0.0F);
^
C:\Users\Admin\MCreatorWorkspaces\domodforyourself\build\sources\main\java\net\mcreator\domodforyourself\entity\EntityVoidWarrior.java:187: error: illegal start of expression .cubeList.add(new ModelBox(, 23, 0, -4.0F, -32.0F, -4.0F, 8, 5, 2, 0.0F, false));
^
C:\Users\Admin\MCreatorWorkspaces\domodforyourself\build\sources\main\java\net\mcreator\domodforyourself\entity\EntityVoidWarrior.java:187: error: illegal start of expression .cubeList.add(new ModelBox(, 23, 0, -4.0F, -32.0F, -4.0F, 8, 5, 2, 0.0F, false));
^
C:\Users\Admin\MCreatorWorkspaces\domodforyourself\build\sources\main\java\net\mcreator\domodforyourself\entity\EntityVoidWarrior.java:188: error: illegal start of expression = new ModelRenderer(this);
^
C:\Users\Admin\MCreatorWorkspaces\domodforyourself\build\sources\main\java\net\mcreator\domodforyourself\entity\EntityVoidWarrior.java:189: error: illegal start of expression .setRotationPoint(0.0F, 9.2321F, -0.0286F);
^
C:\Users\Admin\MCreatorWorkspaces\domodforyourself\build\sources\main\java\net\mcreator\domodforyourself\entity\EntityVoidWarrior.java:191: error: illegal start of expression setRotationAngle(, -0.2618F, 0.0F, 0.0F);
^
C:\Users\Admin\MCreatorWorkspaces\domodforyourself\build\sources\main\java\net\mcreator\domodforyourself\entity\EntityVoidWarrior.java:192: error: illegal start of expression .cubeList.add(new ModelBox(, 0, 15, -4.0F, -22.0F, -8.0F, 8, 4, 4, 0.0F, false));
^
C:\Users\Admin\MCreatorWorkspaces\domodforyourself\build\sources\main\java\net\mcreator\domodforyourself\entity\EntityVoidWarrior.java:192: error: illegal start of expression .cubeList.add(new ModelBox(, 0, 15, -4.0F, -22.0F, -8.0F, 8, 4, 4, 0.0F, false));
^
C:\Users\Admin\MCreatorWorkspaces\domodforyourself\build\sources\main\java\net\mcreator\domodforyourself\entity\EntityVoidWarrior.java:195: error: illegal start of expression .addChild(bone);
^
C:\Users\Admin\MCreatorWorkspaces\domodforyourself\build\sources\main\java\net\mcreator\domodforyourself\entity\EntityVoidWarrior.java:197: error: illegal start of expression = new ModelRenderer(this);
^
C:\Users\Admin\MCreatorWorkspaces\domodforyourself\build\sources\main\java\net\mcreator\domodforyourself\entity\EntityVoidWarrior.java:198: error: illegal start of expression .setRotationPoint(0.0F, 11.2321F, -0.0286F);
^
C:\Users\Admin\MCreatorWorkspaces\domodforyourself\build\sources\main\java\net\mcreator\domodforyourself\entity\EntityVoidWarrior.java:200: error: illegal start of expression setRotationAngle(, 0.1745F, 0.0F, 0.0F);
^
C:\Users\Admin\MCreatorWorkspaces\domodforyourself\build\sources\main\java\net\mcreator\domodforyourself\entity\EntityVoidWarrior.java:201: error: illegal start of expression .cubeList.add(new ModelBox(, 27, 12, -3.0F, -22.0F, 1.0F, 6, 3, 3, 0.0F, false));
^
C:\Users\Admin\MCreatorWorkspaces\domodforyourself\build\sources\main\java\net\mcreator\domodforyourself\entity\EntityVoidWarrior.java:201: error: illegal start of expression .cubeList.add(new ModelBox(, 27, 12, -3.0F, -22.0F, 1.0F, 6, 3, 3, 0.0F, false));
^
22 errors
:compileJava FAILED
FAILURE: Build failed with an exception.
* What went wrong:
Execution failed for task ':compileJava'.
> Compilation failed; see the compiler error output for details.
* Try:
Run with --stacktrace option to get the stack trace. Run with --info or --debug option to get more log output. Run with --scan to get full insights.
* Get more help at https://help.gradle.org
BUILD FAILED in 12s
5 actionable tasks: 4 executed, 1 up-to-date
BUILD FAILED