Gradle build failed

Started by narmundo on Sun, 04/04/2021 - 15:36

Topic category: Troubleshooting, bugs, and solutions

Last seen on 21:14, 17. Apr 2021
Joined Mar 2020
Points:

User statistics:

  • Modifications:
  • Forum topics:
  • Wiki pages:
  • Tracker tickets:
  • MCreator plugins:
  • Comments:
Gradle build failed
Sun, 04/04/2021 - 15:36

hi, i've been using mcreator for a long time, and nothing like that ever happened, i already entered the help page, and none of the solutions worked. a "gradle build failed" message appears

 

Executing Gradle task: runClient
Build info: MCreator 2020.5.47520, forge-1.15.2, 64-bit, 10116 MB, Windows 10, JVM 1.8.0_265, JAVA_HOME: C:\Program Files\Pylo\MCreator\jdk
> Configure project :
New Dep: net.minecraftforge:forge:1.15.2-31.2.0_mapped_snapshot_20200514-1.15.1
FAILURE: Build failed with an exception.
* What went wrong:
A problem occurred configuring root project 'crazycraft'.
> Invalid patcher dependency: net.minecraftforge:forge:1.15.2-31.2.0:userdev
* Try:
Run with --stacktrace option to get the stack trace. Run with --info or --debug option to get more log output. Run with --scan to get full insights.
* Get more help at https://help.gradle.org
BUILD FAILED in 3s
BUILD FAILED
Task completed in 70609 milliseconds