I've got a problem (error

Started by Ghost-Erek on Wed, 04/21/2021 - 07:03

Topic category: Help with MCreator software

Last seen on 07:29, 21. Apr 2021
Joined Apr 2021
Points:

User statistics:

  • Modifications:
  • Forum topics:
  • Wiki pages:
  • Tracker tickets:
  • MCreator plugins:
  • Comments:
I've got a problem (error
Wed, 04/21/2021 - 07:03

Please to repair this

Executing 
    Gradle task: eclipse

Build 
    info: MCreator 2021.1.12313 EAP (12313), forge-1.16.5, 64-bit, 14436 MB, 
    Windows 10, JVM 1.8.0_275, JAVA_HOME: 
    C:\Users\Serafin\Downloads\MCreatorEAP20211b12313\jdk


    Task :downloadMcpConfig


    Task :extractSrg


    Task :createSrgToMcp


    Task :downloadMCMeta

Copying 
    local object: 78/781d243e743f1a716ae36d5fdcbd4c80adf8ee0d Asset: 
    minecraft/textures/gui/title/background/panorama_2.png

minecraft/textures/gui/title/background/panorama_2.png 
    Hash failed.


    Task :downloadAssets FAILED

FAILURE: 
    Build failed with an exception.


    What went wrong:

Execution 
    failed for task ':downloadAssets'.


    Failed to get asset: minecraft/textures/gui/title/background/panorama_2.png

 
     Some assets failed to download or validate, try running the task again.


    Try:

Run 
    with --stacktrace option to get the stack trace. Run with --info or 
    --debug option to get more log output. Run with --scan to get full 
    insights.


    Get more help at https://help.gradle.org

Deprecated 
    Gradle features were used in this build, making it incompatible with 
    Gradle 7.0.

Use 
    '--warning-mode all' to show the individual deprecation warnings.

See 
    https://docs.gradle.org/6.8.1/userguide/command_line_interface.html#sec…

BUILD 
    FAILED in 9s


    actionable tasks: 5 executed

BUILD 
    FAILED

Task 
    completed in 9 seconds