Please help workspace is not opened

Started by TheKralGame on Wed, 04/28/2021 - 09:23

Topic category: Help with MCreator software

Last seen on 12:20, 13. Jun 2021
Joined Feb 2020
Points:

User statistics:

  • Modifications:
  • Forum topics:
  • Wiki pages:
  • Tracker tickets:
  • MCreator plugins:
  • Comments:
Please help workspace is not opened
Wed, 04/28/2021 - 09:23

If i open my workspace i get an error

 

Executing 
    Gradle task: eclipse

Build 
    info: MCreator 2021.1.12313 EAP (12313), forge-1.15.2, 64-bit, 7875 MB, 
    Linux, JVM 1.8.0_275, JAVA_HOME: 
    /home/thekralgame/Desktop/MCreatorEAP20211b12313/jdk/jre

FAILURE: 
    Build failed with an exception.


    What went wrong:


    problem occurred configuring root project 'redbull_gyw'.


    Could not resolve all artifacts for configuration ':classpath'.

 
      > Could not download gson.jar (com.google.code.gson:gson:2.8.5)

 
         > Could not get resource 
    'https://files.minecraftforge.net/maven/com/google/code/gson/gson/2.8.5/…'.

 
            > Could not GET 
    'https://files.minecraftforge.net/maven/com/google/code/gson/gson/2.8.5/…'.

 
               > Read timed out

 
      > Could not download guava.jar (com.google.guava:guava:26.0-jre)

 
         > Could not get resource 
    'https://files.minecraftforge.net/maven/com/google/guava/guava/26.0-jre/…'.

 
            > Could not GET 
    'https://files.minecraftforge.net/maven/com/google/guava/guava/26.0-jre/…'.

 
               > Read timed out

 
      > Could not download fastcsv.jar (de.siegmar:fastcsv:1.0.2)

 
         > Could not get resource 
    'https://files.minecraftforge.net/maven/de/siegmar/fastcsv/1.0.2/fastcsv…'.

 
            > Could not GET 
    'https://files.minecraftforge.net/maven/de/siegmar/fastcsv/1.0.2/fastcsv…'.

 
               > Read timed out

 
      > Could not download localizer.jar (org.jvnet.localizer:localizer:1.12)

 
         > Could not get resource 
    'https://files.minecraftforge.net/maven/org/jvnet/localizer/localizer/1…'.

 
            > Could not GET 
    'https://files.minecraftforge.net/maven/org/jvnet/localizer/localizer/1…'.

 
               > Read timed out

 
      > Could not download j2objc-annotations.jar 
    (com.google.j2objc:j2objc-annotations:1.1)

 
         > Could not get resource 
    'https://files.minecraftforge.net/maven/com/google/j2objc/j2objc-annotat…'.

 
            > Could not GET 
    'https://files.minecraftforge.net/maven/com/google/j2objc/j2objc-annotat…'.

 
               > Read timed out

 
      > Could not download plexus-utils.jar 
    (org.codehaus.plexus:plexus-utils:3.1.0)

 
         > Could not get resource 
    'https://files.minecraftforge.net/maven/org/codehaus/plexus/plexus-utils…'.

 
            > Could not GET 
    'https://files.minecraftforge.net/maven/org/codehaus/plexus/plexus-utils…'.

 
               > Read timed out


    Try:

Run 
    with --stacktrace option to get the stack trace. Run with --info or 
    --debug option to get more log output. Run with --scan to get full 
    insights.


    Get more help at https://help.gradle.org

BUILD 
    FAILED in 3m 19s

BUILD 
    FAILED

Task 
    completed in 4 minutes and 34 seconds